program: Gaussian 09
title: 000099559
version: EM64L-G09RevD.01
frameworkgroup: C1[X(C8H17Cl2N2O2P)]
method: RPBEPBE
basis: SDD
operation: Freq
keyword: #p
keyword: freq=noraman
keyword: PBEPBE/SDD
title: #p freq=noraman PBEPBE/SDD
converged: YES YES NO NO
title: Mulliken charges:
elementType: Cl Cl P O O N N C C C C C C C C H H H H H H H H H H H H H H H H H
charge: -0.056725 -0.064155 1.327812 -0.467099 -0.581935 -0.773515 -0.508602 0.011492 -0.372462 -0.310629 -0.724895 -0.268107 -0.312771 -0.571038 -0.564346 0.221113 0.227964 0.203806 0.351373 0.196473 0.242333 0.236939 0.272592 0.237386 0.267263 0.217953 0.228171 0.238384 0.262642 0.274167 0.266149 0.292267
chargesum: 0.00000
title: Mulliken charges with hydrogens summed into heavy atoms:
elementType: Cl Cl P O O N N C C C C C C C C
charge: -0.056725 -0.064155 1.327812 -0.467099 -0.581935 -0.422141 -0.508602 0.232605 0.059308 0.128177 -0.040386 0.241424 0.191878 -0.034230 -0.005930
polarizability: 1.59504690e+02 4.92690456e+00 1.56620550e+02 -4.79490316e+00 -1.22456577e+00 1.22743200e+02
1716.lowfreq: -10.4523 -3.3496 0.0021 0.0028 0.0037 9.0313 13.0379 35.4603 45.1096
frequency: 10.6773 35.4092 45.0642 54.7861 76.9654 81.6595 92.6723 104.4710 184.9024 198.1576 208.6973 214.5561 214.9052 230.1654 241.1460 270.5692 293.1317 313.0972 334.7029 371.8295 379.2557 418.8121 444.4163 472.2796 486.3654 543.3152 603.8701 657.7642 691.5508 698.2008 767.5636 774.1693 790.8665 826.7866 849.4731 938.3062 947.1728 952.4812 969.8105 996.9059 1028.1838 1029.9646 1042.6414 1046.6850 1065.0089 1096.6830 1109.3093 1126.9585 1163.9814 1193.6258 1206.2566 1229.2431 1234.9532 1254.6363 1257.6251 1290.3236 1294.6935 1314.5223 1326.8961 1345.0042 1349.6263 1357.5739 1368.7664 1380.4442 1394.9699 1434.1452 1445.4173 1453.1519 1456.5954 1460.3646 1471.4933 1471.9853 1477.9606 2957.9070 2975.2497 2982.4056 2989.8336 3003.2323 3017.8443 3057.2921 3060.7698 3061.8002 3074.2631 3079.6600 3082.7953 3086.9089 3092.6870 3146.3353 3150.7553 3546.4569
redmass: 5.9663 15.0552 5.2783 5.9882 2.3484 2.8779 2.9301 3.9628 3.4366 3.9664 6.2864 3.6551 3.5147 1.3763 3.7509 2.4616 3.1745 3.3354 2.6929 5.2419 2.0793 3.5603 4.9454 3.3332 3.6557 2.6413 5.4383 8.8052 5.6243 4.5141 1.1607 1.1919 2.4228 3.1108 3.0601 2.9108 2.6282 1.7214 1.5325 1.4830 2.9239 2.8189 2.5279 4.0353 2.8544 2.4824 1.8167 2.1144 2.3568 2.0955 1.3008 1.5863 1.2355 1.1651 1.1541 1.1744 1.2312 1.3140 1.1755 1.2430 1.2100 1.2265 1.2625 1.3738 1.2204 1.0948 1.0834 1.0879 1.0881 1.0958 1.0512 1.0680 1.0519 1.0845 1.0660 1.0368 1.0599 1.0626 1.0609 1.1011 1.0579 1.0574 1.1002 1.0993 1.1038 1.0995 1.0997 1.1120 1.1116 1.0765
irintensity: 3.3829 0.6378 0.6362 0.5978 4.7509 2.1154 0.4435 0.8535 1.0274 3.3178 5.0344 3.2141 4.8827 0.4999 1.9427 3.7964 19.9821 5.8125 27.8059 4.2878 46.1865 85.2814 7.8345 9.5998 7.2675 18.5901 27.1755 46.3497 126.1515 148.2621 2.5153 13.6543 12.1580 73.3659 40.1861 49.4456 60.2268 61.3858 19.4048 3.5637 11.7018 4.0395 67.5419 66.1491 27.6399 19.5373 48.1910 14.7149 82.0707 46.8206 6.6631 7.2235 5.8581 16.1931 3.1458 5.6433 4.6937 2.3997 9.1690 6.7287 2.5842 11.9838 1.2677 57.2194 7.0688 8.8977 10.7707 5.5032 4.5964 14.6363 19.4260 11.3620 4.4985 19.3397 50.1155 18.6464 34.5009 17.2627 12.8492 22.9250 2.3878 29.6474 1.9069 32.5009 6.1649 27.7392 22.7650 10.2788 16.5012 38.2616
temp: 298.150 k
press: 1.00000 atm
elementType: 17 17 15 8 8 7 7 6 6 6 6 6 6 6 6 1 1 1 1 1 1 1 1 1 1 1 1 1 1 1 1 1
symmnumber: 1
zpe: 671899.5 jmol-1
zpe.correction: 0.255913 hartree
zpe.thermalcorrener: 0.274187 hartree
zpe.thermalcorrenthalpy: 0.275131 hartree
zpe.thermalcorrgfe: 0.206578 hartree
zpe.sumelectzpe: -1835.110051 hartree
zpe.sumelectthermal: -1835.091777 hartree
zpe.sumelectthermalent: -1835.090832 hartree
zpe.sumelectthermalfe: -1835.159385 hartree
dipole: 4.4421 -1.1758 -4.8858
dipole: 6.7072
quadrupole: -107.3655 -124.5804 -123.7307
quadrupole: -4.5776 -8.1381 5.5337
quadrupole: 11.1933 -6.0215 -5.1718 -4.5776 -8.1381 5.5337
hfenergy: -1835.3659638 hartree
pointgroup: C01 [X(C8H17Cl2N2O2P1)]
dipole: 1.882177 0.0694315 -1.8482018 debye
polarizability: 157.8493961|5.4686772|158.6008831|-2.471937|1.7683576|122.418161 unknown
InChI: InChI=1S/C8H17Cl2N2O2P/c1-8-2-7-14-15(13,11-8)12(5-3-9)6-4-10/h8,11H,2-7H2,1H3
charge 0 multiplicity 1
32 atoms
Cl -3.590743 -2.946543 -0.926456
Cl -2.380627 3.879156 -0.182671
P  0.527422 -0.090905 1.143676
O  1.046326 -1.742696 0.872147
O  0.290854 0.229686 2.683765
N  1.724296 0.896823 0.384683
N  -0.851184 0.009639 0.047602
C  2.453651 0.434867 -0.833203
C  2.91892 -1.037387 -0.670354
C  1.745301 -2.004426 -0.420179
C  3.623849 1.395976 -1.099616
C  -1.935997 -0.993729 0.213947
C  -1.2370 1.342686 -0.478153
C  -2.101025 -1.793359 -1.086456
C  -1.879215 2.232955 0.603082
H  1.749707 0.481867 -1.691324
H  3.638808 -1.10331 0.167604
H  3.440441 -1.359207 -1.593535
H  2.218656 1.539478 1.008707
H  1.01148 -1.9381 -1.250172
H  2.090661 -3.046258 -0.321385
H  -2.892473 -0.501558 0.47301
H  -1.691581 -1.681615 1.04171
H  -1.944331 1.198376 -1.314793
H  -0.339697 1.845453 -0.877321
H  4.352446 1.367714 -0.267298
H  4.154825 1.112554 -2.025103
H  3.261976 2.433154 -1.215213
H  -2.315519 -1.151024 -1.953745
H  -1.237555 -2.443698 -1.283018
H  -2.804188 1.807788 1.019667
H  -1.175485 2.480145 1.411396
