program: Gaussian 09
title: 000099529
version: EM64L-G09RevD.01
frameworkgroup: C1[X(C9H12N2O5S)]
method: RPBEPBE
basis: SDD
operation: Freq
keyword: #p
keyword: freq=noraman
keyword: PBEPBE/SDD
title: #p freq=noraman PBEPBE/SDD
converged: YES YES NO NO
title: Mulliken charges:
elementType: S O O O O O N N C C C C C C C C C H H H H H H H H H H H H
charge: -0.028628 -0.252943 -0.427713 -0.443186 -0.270189 -0.265387 -0.187033 -0.390516 -0.128654 -0.000467 -0.546570 -0.046458 -0.377078 -0.057194 0.210287 -0.325621 0.206739 0.215777 0.287531 0.238815 0.285178 0.289902 0.210483 0.219005 0.341575 0.347941 0.363653 0.358766 0.171982
chargesum: 0.00000
title: Mulliken charges with hydrogens summed into heavy atoms:
elementType: S O O O O O N N C C C C C C C C C
charge: 0.143354 -0.252943 -0.086137 -0.084420 -0.270189 -0.265387 -0.187033 -0.026863 0.087123 0.287065 -0.022577 0.243444 0.052411 0.290747 0.210287 -0.325621 0.206739
polarizability: 1.90635992e+02 2.07159900e+01 1.59809318e+02 7.43260993e+00 -2.46505919e+00 8.24322358e+01
1716.lowfreq: -2.3294 -0.0023 -0.0018 -0.0018 4.1225 9.6465 36.6812 41.8944 70.6450
frequency: 36.5837 41.8185 70.6371 94.9055 113.1225 119.3077 163.4529 182.1555 198.6679 220.5913 245.4277 281.5173 284.8939 298.2298 316.0233 326.7763 334.2124 347.2449 383.9226 412.7431 423.4588 456.4597 507.7598 547.3699 611.7625 624.9964 694.8712 700.8966 709.6937 735.9882 752.9451 772.3339 788.6690 807.9922 859.2714 863.4531 935.7563 944.4581 947.0245 972.7572 987.2115 1024.2872 1037.1339 1045.7499 1060.0740 1080.3202 1111.3919 1158.7171 1177.4895 1187.5583 1202.3843 1232.3601 1243.8309 1250.9616 1264.6475 1288.1682 1307.4814 1334.0831 1336.0384 1355.9759 1362.1578 1380.9181 1407.6768 1422.1746 1453.4385 1474.4534 1590.3421 1610.0345 1641.8853 2342.7589 2937.6278 2973.3963 2992.6963 3033.8482 3067.5736 3097.8998 3107.0916 3134.9902 3525.8695 3568.7874 3575.5509
redmass: 5.3732 6.1862 8.7428 5.1875 6.6732 7.6007 3.8063 6.5466 4.0431 6.1476 5.1484 1.2438 2.8739 1.2496 1.5455 3.2035 4.2314 11.6517 6.2003 6.3158 4.8445 2.7082 3.0435 5.0920 5.4246 5.9995 2.6748 3.5896 7.7000 5.2337 6.8255 2.1962 3.4351 3.3944 2.6290 1.3452 2.8349 1.8229 1.8386 4.3773 1.9928 3.5100 3.5412 2.9854 2.4336 2.3463 6.5292 1.2277 1.3398 4.3159 1.2489 1.2858 2.0489 1.2816 1.4660 1.3905 1.4506 1.6227 1.2733 1.5111 1.6731 1.5524 4.0933 1.4406 1.0885 1.0781 5.7141 9.1231 6.2035 1.0371 1.0562 1.0855 1.1042 1.0646 1.0885 1.0888 1.1013 1.0958 1.0770 1.0663 1.0667
irintensity: 3.5860 1.2717 1.2788 4.3589 3.7433 3.4520 9.2380 2.8948 12.3032 11.3671 4.9926 125.0640 10.2177 202.8442 26.7561 5.0566 45.5713 10.7904 0.8529 6.5326 0.7321 3.4232 27.7590 32.6557 11.5596 15.8265 12.2106 16.4267 3.2208 5.8205 0.4283 122.0151 17.3222 22.0645 27.5720 18.3611 55.3551 44.4963 10.1455 67.2125 24.5193 27.9865 115.6838 50.6809 11.6246 17.8839 76.8272 51.4117 7.5119 9.9496 31.6997 3.5983 73.1391 17.8262 167.1005 10.0879 9.3010 52.1906 5.0330 5.5403 1.5275 2.0399 74.0233 0.9494 12.7249 7.0606 127.6112 290.5035 597.1741 19.7395 38.7474 49.3062 68.7911 13.9115 7.3434 12.0260 13.8984 73.2875 63.0782 9.0793 9.6403
temp: 298.150 k
press: 1.00000 atm
elementType: 16 8 8 8 8 8 7 7 6 6 6 6 6 6 6 6 6 1 1 1 1 1 1 1 1 1 1 1 1
symmnumber: 1
zpe: 559357.0 jmol-1
zpe.correction: 0.213048 hartree
zpe.thermalcorrener: 0.229572 hartree
zpe.thermalcorrenthalpy: 0.230516 hartree
zpe.thermalcorrgfe: 0.168621 hartree
zpe.sumelectzpe: -1232.540671 hartree
zpe.sumelectthermal: -1232.524147 hartree
zpe.sumelectthermalent: -1232.523202 hartree
zpe.sumelectthermalfe: -1232.585097 hartree
dipole: -4.1471 0.7036 4.2108
dipole: 5.9518
quadrupole: -114.0041 -106.3603 -107.3325
quadrupole: 3.3397 -11.7806 6.4661
quadrupole: -4.7718 2.8720 1.8998 3.3397 -11.7806 6.4661
hfenergy: -1232.7537185 hartree
pointgroup: C01 [X(C9H12N2O5S1)]
dipole: 1.6723364 -0.0616736 1.637882 debye
polarizability: 178.835441|26.4195867|170.1470553|-6.114973|10.3881765|83.8950499 unknown
InChI: InChI=1S/C9H12N2O5S/c12-3-5-4(13)1-7(16-5)11-2-6(17)8(14)10-9(11)15/h2,4-5,7,10,12-13,17H,1,3H2
charge 0 multiplicity 1
29 atoms
S  -2.610947 -2.972333 -0.40601
O  1.742091 -0.099923 -1.115522
O  4.115726 1.427334 -0.044445
O  1.844634 -2.794749 -0.290836
O  -0.981184 2.712291 0.348757
O  -4.320118 -0.575337 0.502517
N  -0.417254 0.505682 -0.225908
N  -2.627099 1.034478 0.401065
C  3.114806 0.649683 0.694691
C  0.996599 0.976539 -0.49752
C  1.747659 1.372098 0.80628
C  2.796536 -0.578057 -0.179542
C  2.330124 -1.782832 0.652818
C  -0.795229 -0.825037 -0.421923
C  -1.319406 1.503608 0.183185
C  -2.083823 -1.247542 -0.181596
C  -3.105639 -0.290375 0.260227
H  3.506366 0.364965 1.693817
H  0.918878 1.811372 -1.212345
H  1.190503 1.014776 1.690011
H  1.843538 2.465608 0.892693
H  3.649653 -0.856965 -0.817054
H  1.526754 -1.488537 1.363139
H  3.198501 -2.157419 1.23552
H  4.232511 2.310196 0.388935
H  0.001308 -1.48649 -0.779973
H  -3.307848 1.741338 0.697339
H  1.607996 -3.623058 0.196937
H  -3.916537 -2.661415 -0.023356
