program: Gaussian 09
title: 000099536
version: EM64L-G09RevD.01
frameworkgroup: C1[X(C7H15N3O2)]
method: RPBEPBE
basis: SDD
operation: Freq
keyword: #p
keyword: freq=noraman
keyword: PBEPBE/SDD
title: #p freq=noraman PBEPBE/SDD
converged: YES YES NO NO
title: Mulliken charges:
elementType: O O N N N C C C C C C C H H H H H H H H H H H H H H H
charge: -0.303035 -0.285222 -0.051925 -0.322280 0.062221 -0.363265 -0.329467 -0.351894 -0.434319 -0.689725 0.281143 -0.762129 0.216317 0.211982 0.221630 0.264219 0.198843 0.191433 0.260772 0.277898 0.212858 0.218310 0.213914 0.332346 0.256388 0.218131 0.254856
chargesum: 0.00000
title: Mulliken charges with hydrogens summed into heavy atoms:
elementType: O O N N N C C C C C C C
charge: -0.303035 -0.285222 -0.051925 0.010066 0.062221 0.065034 0.156382 0.038383 0.104351 -0.044643 0.281143 -0.032753
polarizability: 1.20207519e+02 -3.59511991e+00 1.11197106e+02 5.73060913e+00 -7.67361525e+00 8.58480741e+01
1716.lowfreq: -11.1619 -7.4213 -0.0013 -0.0012 -0.0010 13.1352 22.2513 48.6264 53.7041
frequency: 20.1031 48.5733 53.6746 62.7381 76.6965 100.4666 106.9452 115.4487 196.6702 211.6275 228.5625 261.6866 295.0450 338.9127 364.8042 404.5715 460.5081 514.3910 595.3765 619.5932 630.1200 687.3029 733.8763 793.4368 824.9209 855.6040 900.2386 932.2559 973.9726 1000.2060 1034.1603 1043.1783 1060.2912 1076.0475 1097.4476 1138.2802 1149.4100 1185.7665 1220.7673 1249.6745 1277.5822 1279.3662 1286.6826 1305.6697 1329.1327 1350.8869 1367.0471 1389.0144 1389.8693 1410.3181 1426.0636 1450.6973 1464.3168 1467.2739 1473.4749 1476.1283 1479.9232 1485.5549 1493.1071 1611.8614 2961.8321 2967.9933 2976.1784 3000.4227 3004.4890 3012.1488 3020.1577 3046.7577 3064.3442 3076.4474 3076.4646 3099.0653 3106.6471 3122.6177 3557.4217
redmass: 3.3843 3.1176 2.5356 1.4993 2.2762 2.3850 2.2020 3.6383 3.2725 6.4680 1.2167 3.9524 4.9477 3.1655 3.7413 3.2184 3.1123 2.9403 3.4626 3.3067 1.3503 5.3842 1.0753 1.1742 3.0775 5.4684 1.8170 1.1862 1.7521 2.7640 3.6151 1.7554 3.0673 2.3742 3.1856 2.6457 1.7634 2.6706 1.3101 1.9721 1.4594 1.1459 1.0871 6.1368 1.4724 1.5240 1.3680 1.2114 1.2209 1.2507 1.1850 1.0458 1.1577 1.0757 1.0684 1.0429 1.6100 1.0945 1.0975 6.3603 1.0614 1.0592 1.0363 1.0359 1.0606 1.1000 1.0998 1.0591 1.1026 1.1013 1.1001 1.0981 1.1009 1.1051 1.0783
irintensity: 0.6586 6.6606 6.3249 6.9628 3.1160 1.3431 2.0281 7.2161 0.1035 5.2670 0.0381 4.4591 0.3858 1.6270 6.6522 12.1327 6.4406 28.8764 20.0104 23.8134 76.9921 6.7176 8.3470 0.8153 10.8054 22.6908 20.4875 0.8827 3.3254 20.6657 30.0298 16.5441 74.6071 2.3236 5.2992 45.3575 13.3256 35.5767 2.0297 64.6177 27.4257 8.1044 0.9658 73.5761 33.3466 4.0235 7.2912 16.2175 48.6572 4.7389 46.4709 17.7909 86.6014 1.1868 1.3157 14.4883 136.7972 12.0681 21.0655 161.2890 9.4827 43.5527 30.8676 8.0150 26.6625 11.1035 0.9125 16.8408 0.5534 87.2521 61.2559 8.7208 16.6261 1.4992 32.2803
temp: 298.150 k
press: 1.00000 atm
elementType: 8 8 7 7 7 6 6 6 6 6 6 6 1 1 1 1 1 1 1 1 1 1 1 1 1 1 1
symmnumber: 1
zpe: 591973.9 jmol-1
zpe.correction: 0.225471 hartree
zpe.thermalcorrener: 0.240086 hartree
zpe.thermalcorrenthalpy: 0.241030 hartree
zpe.thermalcorrgfe: 0.181524 hartree
zpe.sumelectzpe: -589.427480 hartree
zpe.sumelectthermal: -589.412865 hartree
zpe.sumelectthermalent: -589.411921 hartree
zpe.sumelectthermalfe: -589.471427 hartree
dipole: -0.6199 -0.8582 0.7412
dipole: 1.2924
quadrupole: -60.7527 -88.8279 -70.5649
quadrupole: -3.3632 4.9339 7.9313
quadrupole: 12.6291 -15.4461 2.8169 -3.3632 4.9339 7.9313
hfenergy: -589.6529508 hartree
pointgroup: C01 [X(C7H15N3O2)]
dipole: -0.3179396 -0.1963583 0.3448072 debye
polarizability: 117.8207502|-1.3991409|104.4835628|8.3177061|-14.7954446|94.9483862 unknown
InChI: InChI=1S/C7H15N3O2/c1-3-4-5-10(9-12)6-8-7(2)11/h8H,3-6H2,1-2H3
charge 0 multiplicity 1
27 atoms
O  -0.174712 2.167769 -1.678215
O  -2.141228 -1.670726 0.652428
N  0.223268 0.731642 -0.01356
N  -2.174606 0.376512 -0.441736
N  0.703077 1.391843 -1.118119
C  2.449974 -0.480349 -0.015471
C  1.099556 -0.24376 0.683725
C  3.287397 -1.529901 0.751375
C  -1.174151 0.963281 0.443761
C  4.648323 -1.799546 0.074559
C  -2.592662 -0.939902 -0.283212
C  -3.628491 -1.431287 -1.286138
H  3.010676 0.46938 -0.092145
H  2.276325 -0.821091 -1.053548
H  1.27044 0.12332 1.717235
H  0.530251 -1.190235 0.76493
H  2.716627 -2.477851 0.82514
H  3.45496 -1.183512 1.791848
H  -1.272151 0.502971 1.438606
H  -1.337039 2.052833 0.488131
H  5.251428 -0.874379 0.012742
H  5.235015 -2.549545 0.635498
H  4.510522 -2.178641 -0.955311
H  -2.436417 0.917719 -1.267651
H  -4.554396 -1.697017 -0.746954
H  -3.870993 -0.689269 -2.065529
H  -3.256394 -2.351658 -1.767289
