program: Gaussian 09
title: 000099549
version: EM64L-G09RevD.01
frameworkgroup: C1[X(C12H17N5O4)]
method: RPBEPBE
basis: SDD
operation: Freq
keyword: #p
keyword: freq=noraman
keyword: PBEPBE/SDD
title: #p freq=noraman PBEPBE/SDD
converged: YES YES NO NO
title: Mulliken charges:
elementType: O O O O N N N N N C C C C C C C C C C C C H H H H H H H H H H H H H H H H H
charge: -0.246712 -0.428466 -0.443592 -0.229167 -0.216056 -0.042416 -0.084372 -0.123638 -0.592300 -0.071609 -0.138470 -0.514924 -0.108611 -0.362438 0.146136 -0.227954 -0.120868 0.167852 -0.022598 -0.223473 -0.677084 0.266684 0.244490 0.252503 0.275230 0.284300 0.222707 0.212199 0.351248 0.323160 0.356002 0.222700 0.223612 0.326166 0.328451 0.205059 0.234270 0.231980
chargesum: 0.00000
title: Mulliken charges with hydrogens summed into heavy atoms:
elementType: O O O O N N N N N C C C C C C C C C C C C
charge: -0.246712 -0.077218 -0.087591 -0.229167 -0.216056 -0.042416 -0.084372 -0.123638 0.062318 0.195075 0.106019 0.012809 0.175690 0.072467 0.146136 0.095206 -0.120868 0.167852 -0.022598 0.222838 -0.005775
polarizability: 2.43401479e+02 -4.34435999e+00 1.94602073e+02 -1.00094480e+01 5.67548330e+00 1.10833888e+02
1716.lowfreq: -8.3998 -3.7621 0.0005 0.0006 0.0008 6.3414 19.6438 29.4597 58.1667
frequency: 19.4951 29.4569 58.1556 63.1371 79.3140 95.6438 108.6593 122.1562 135.2785 148.6689 184.5057 203.6494 228.1751 246.5919 252.2575 273.9698 278.0290 305.2704 313.9929 337.1534 343.5913 371.3165 388.8790 406.1494 428.5340 459.0678 490.8734 508.9005 510.5380 579.8195 622.0400 632.1943 651.5296 678.5583 704.0345 715.6332 719.6684 757.3054 779.0235 789.6099 795.3333 802.3418 834.2880 837.5352 845.9683 905.2976 928.6676 965.3889 976.8543 986.7244 1005.1019 1014.8336 1028.5129 1037.5632 1049.3901 1062.8805 1069.6228 1115.9270 1133.6292 1153.3400 1170.8484 1179.8135 1189.8749 1211.4753 1215.3374 1230.6578 1243.2821 1245.1312 1266.1353 1278.5622 1290.7187 1299.3846 1325.4334 1329.9092 1344.8452 1351.0404 1381.1124 1382.3026 1390.5268 1401.5220 1416.5261 1436.6389 1456.2695 1461.2278 1467.5759 1471.7721 1486.7061 1494.9353 1536.4663 1577.5732 1607.2762 2943.5155 2995.8607 2998.1751 3007.8248 3041.3121 3046.4835 3067.1662 3085.0988 3089.0755 3092.7157 3108.9025 3119.3855 3233.9922 3538.9403 3568.6553 3571.4966 3728.0066
redmass: 4.6600 4.6199 4.2712 3.8785 2.7723 5.2585 3.0730 4.0205 5.9746 3.5053 3.9049 3.6512 4.3291 1.9919 1.9713 1.9218 2.0719 4.3298 4.3800 4.2963 4.4965 4.1579 1.3931 3.9034 1.2040 2.4548 6.1373 1.7450 1.4293 8.2540 5.4645 5.5102 7.8205 4.1161 5.3241 11.2144 5.6776 4.3443 8.9911 3.9523 6.1527 1.0970 1.7647 2.4907 3.0002 3.7267 2.4742 4.8980 2.7048 3.8307 3.9919 3.1797 3.0738 2.8373 2.6401 2.0080 2.0073 2.2663 1.4443 1.3137 4.5951 1.8783 1.4234 1.6003 1.8025 1.4396 1.4518 1.1442 1.5168 3.0031 1.4493 1.5107 3.5884 1.9988 1.3651 1.3281 2.4175 1.5790 2.8867 1.3911 1.4411 3.7016 1.1059 1.0400 1.0776 1.0831 1.0826 3.1474 8.4151 7.1829 1.6191 1.0563 1.0361 1.1043 1.0577 1.0860 1.0652 1.1067 1.0864 1.0896 1.0985 1.1023 1.1027 1.1001 1.0658 1.0441 1.0666 1.1059
irintensity: 2.7532 0.2606 1.4153 0.7102 5.0649 5.0670 3.0859 8.6182 4.3692 13.1927 13.9480 2.0081 0.5762 11.9357 31.6492 67.5891 87.6000 1.1725 6.4710 5.9650 4.3290 20.4289 118.1019 10.9742 303.2320 6.6970 0.8163 16.0148 11.3283 0.6427 17.5415 3.5257 6.0514 20.8923 3.4669 4.4532 5.8529 13.8674 21.7910 8.5794 5.4885 3.8393 16.0476 11.1631 23.3381 86.8873 33.8206 79.4497 31.1751 2.7307 1.1520 155.3955 79.0437 18.9297 12.9925 22.4711 21.5955 4.4616 5.0045 79.1478 93.9443 2.6764 28.5965 64.7471 141.8763 54.4549 140.1568 0.4620 2.4841 7.0327 15.3752 24.8733 88.7164 35.2989 67.2557 56.5272 46.0139 26.9539 87.2032 8.6157 1.5154 58.9936 25.5274 11.5406 10.3638 23.1502 19.1685 100.9521 348.2507 249.5647 488.1331 44.0316 25.5007 54.7770 24.2069 18.0277 5.1853 10.6698 14.9803 27.8677 30.3324 42.2476 9.6084 27.1903 10.7591 117.2984 7.0468 43.2167
temp: 298.150 k
press: 1.00000 atm
elementType: 8 8 8 8 7 7 7 7 7 6 6 6 6 6 6 6 6 6 6 6 6 1 1 1 1 1 1 1 1 1 1 1 1 1 1 1 1 1
symmnumber: 1
zpe: 783240.1 jmol-1
zpe.correction: 0.298320 hartree
zpe.thermalcorrener: 0.318538 hartree
zpe.thermalcorrenthalpy: 0.319482 hartree
zpe.thermalcorrgfe: 0.248504 hartree
zpe.sumelectzpe: -1040.524037 hartree
zpe.sumelectthermal: -1040.503820 hartree
zpe.sumelectthermalent: -1040.502875 hartree
zpe.sumelectthermalfe: -1040.573853 hartree
dipole: -1.0013 2.8673 2.9191
dipole: 4.2125
quadrupole: -115.3015 -116.8597 -119.5666
quadrupole: -11.7445 1.7850 -9.2184
quadrupole: 1.9411 0.3829 -2.3240 -11.7445 1.7850 -9.2184
hfenergy: -1040.8223573 hartree
pointgroup: C01 [X(C12H17N5O4)]
dipole: 0.4490139 -1.0274419 1.2204368 debye
polarizability: 243.373002|-0.1985586|193.335262|12.6516627|-9.971038|112.129177 unknown
InChI: InChI=1S/C12H17N5O4/c1-2-20-11-9-10(15-12(13)16-11)17(5-14-9)8-3-6(19)7(4-18)21-8/h5-8,18-19H,2-4,13H2,1H3
charge 0 multiplicity 1
38 atoms
O  -3.177274 0.156138 -1.199684
O  -4.976266 -1.916096 0.096447
O  -3.5337 2.738116 0.115626
O  3.595574 1.328643 -0.020535
N  -0.839261 0.044992 -0.6509
N  0.616352 1.824061 -0.682584
N  0.724175 -1.777602 -0.061727
N  3.024486 -0.951184 0.233165
N  2.497036 -3.216252 0.490139
C  -2.081886 -0.747063 -0.837222
C  -3.98608 -1.013131 0.696422
C  -2.527128 -1.493514 0.456374
C  -4.016911 0.376125 0.019139
C  -3.504423 1.509094 0.915751
C  0.413266 -0.478975 -0.331102
C  -0.654557 1.431239 -0.868918
C  1.305045 0.639278 -0.348259
C  2.658735 0.326067 -0.039748
C  2.058465 -1.939926 0.209309
C  5.005035 0.945922 0.293243
C  5.812469 2.239087 0.250394
H  -1.926433 -1.425291 -1.693635
H  -4.258475 -0.988156 1.763086
H  -1.867988 -1.22617 1.298424
H  -2.494794 -2.586648 0.336228
H  -5.018557 0.631112 -0.362812
H  -2.479851 1.293752 1.284203
H  -4.187392 1.587258 1.789689
H  -4.854937 -1.900972 -0.888712
H  -1.493051 2.070013 -1.138771
H  -3.177882 3.491165 0.651038
H  5.025967 0.462153 1.28651
H  5.342618 0.206997 -0.455872
H  1.832716 -3.984338 0.474913
H  3.481678 -3.367639 0.686386
H  6.874256 2.02508 0.47178
H  5.749924 2.707888 -0.746285
H  5.437849 2.960976 0.995899
