program: Gaussian 09
title: 000099606
version: EM64L-G09RevD.01
frameworkgroup: C1[X(C24H32O4)]
method: RPBEPBE
basis: SDD
operation: Freq
keyword: #pfreq=noraman
keyword: PBEPBE/SDD
title: #p freq=noraman PBEPBE/SDD
converged: YES YES NO NO
title: Mulliken charges:
elementType: O O O O C C C C C C C C C C C C C C C C C C C C C C C C H H H H H H H H H H H H H H H H H H H H H H H H H H H H H H H H
charge: -0.459749 -0.193425 -0.218355 -0.208579 0.225958 -0.183531 0.375105 -0.097677 0.352587 -0.536098 -0.533151 -0.253693 -0.087799 -0.599266 -0.500669 -0.515300 -0.470496 -0.492807 -0.853468 -0.809031 -0.592899 -0.529150 0.437365 0.169582 -0.304202 -0.317804 -0.305991 0.110761 0.211421 0.203157 0.221548 0.207101 0.221656 0.210379 0.197970 0.209852 0.219028 0.251438 0.236773 0.224021 0.253303 0.222626 0.206280 0.216437 0.214905 0.217599 0.225360 0.237785 0.233285 0.220509 0.221381 0.222823 0.245448 0.234883 0.334314 0.221739 0.244204 0.238652 0.315025 0.250883
chargesum: 0.00000
title: Mulliken charges with hydrogens summed into heavy atoms:
elementType: O O O O C C C C C C C C C C C C C C C C C C C C C C C C
charge: -0.125435 -0.193425 -0.218355 -0.208579 0.225958 0.027890 0.375105 0.105479 0.352587 -0.107449 -0.101117 -0.055722 0.122053 -0.128800 -0.039875 -0.039371 -0.047779 -0.060303 -0.157038 -0.144318 -0.112569 -0.063206 0.437365 0.169582 -0.065550 -0.002779 -0.055109 0.110761
polarizability: 3.51379327e+02 4.43004153e-01 2.27600429e+02 -1.98427269e+01 2.36201473e+00 2.03253537e+02
1716.lowfreq: -10.7767 -3.1326 -0.0006 -0.0004 0.0006 11.5189 24.1332 27.9452 45.6749
frequency: 23.1900 27.9061 45.6377 57.2254 61.9668 84.6142 117.8990 125.4219 145.1362 154.8738 184.6603 192.0415 200.1342 203.9711 219.0207 236.6092 261.0926 267.3955 278.6909 293.5644 302.0935 318.8287 333.6261 342.3452 349.9156 368.9576 375.9261 381.7096 388.8066 400.4564 424.8310 437.6650 444.6774 455.1794 470.9470 472.7162 495.5722 509.1580 511.9044 522.2642 529.8974 558.7730 593.6041 598.3465 618.4827 640.0716 660.7366 669.5282 703.4638 718.4453 738.1307 759.9436 772.6159 803.5417 809.3878 821.0890 824.8612 830.8359 863.1049 872.7281 890.2259 906.4083 908.6504 912.4829 917.0204 920.1765 933.3619 941.0099 952.3862 962.2083 986.6581 990.3908 1001.6073 1013.8851 1016.1597 1021.4069 1028.7658 1049.9286 1059.2480 1064.6174 1073.0006 1081.6117 1095.5815 1098.5326 1104.8895 1122.2468 1127.0722 1136.7291 1139.6374 1143.8938 1155.3977 1162.9870 1179.7591 1195.5420 1204.9313 1206.5092 1212.1172 1220.4121 1225.1353 1227.1786 1247.0058 1252.0421 1255.0731 1261.5795 1265.6820 1282.1719 1286.5022 1296.4814 1304.3048 1308.8384 1310.5474 1315.3769 1322.0358 1331.2006 1336.6699 1338.3491 1339.7708 1346.5620 1348.8079 1354.0073 1363.7782 1365.0370 1390.4520 1392.3685 1420.3968 1445.7289 1456.2199 1456.5827 1463.8359 1464.4735 1471.1089 1473.3941 1477.2517 1479.2221 1481.8243 1484.8942 1488.9943 1493.7794 1529.8503 1605.9872 1635.0472 1705.3102 2917.6697 2945.4784 2956.5374 2962.4057 2972.2600 2976.1823 2978.2523 2978.9852 2979.9009 2981.7933 2982.9178 2984.8143 2988.5593 3011.8966 3016.6325 3023.8332 3028.5160 3033.6565 3043.7847 3049.6198 3060.9115 3064.7798 3065.7973 3070.4732 3070.5898 3078.7097 3082.8905 3090.5310 3119.1995 3170.9498 3181.1382 3544.7198
redmass: 5.2769 6.8119 6.5800 4.2611 4.7726 4.5906 4.4734 3.3793 4.1572 2.4303 2.4191 3.2086 1.3178 2.0656 2.2001 2.6714 2.6103 2.8958 2.8835 3.3250 2.6603 2.6540 2.3369 1.8594 3.0327 2.2780 2.4449 1.9355 3.2669 3.0406 2.6472 3.9304 4.4336 2.8872 3.3184 2.6184 3.3684 2.8466 2.8009 3.1430 4.6677 2.7470 2.4611 6.0382 3.7674 2.6355 7.3373 3.5807 3.6417 4.6239 2.4967 2.9883 2.3133 1.9089 2.3765 2.3748 2.0796 1.8033 2.6167 1.9371 2.3627 2.1016 1.9202 1.8527 2.1714 2.6911 2.0017 2.0722 1.8254 1.9267 1.3338 1.6618 1.8236 1.8738 2.1739 2.2531 2.5450 2.0497 2.7798 2.4758 2.1307 1.7227 2.0176 2.3800 1.6039 2.2492 2.1907 2.0880 2.4024 1.9159 2.0264 1.7851 1.7523 1.6179 1.8772 1.6654 1.5653 1.4296 1.5779 1.6819 1.6406 1.5460 1.7894 1.4012 1.6425 1.4042 1.4531 1.2944 1.3786 1.3523 1.3331 1.4745 1.4453 1.4964 1.4790 1.3781 1.4100 1.4802 1.4986 1.4704 1.3977 1.4455 1.2200 1.2119 2.2714 1.0897 1.0858 1.0852 1.0781 1.0763 1.0745 1.0746 1.0648 1.0860 1.0604 1.0896 1.0617 1.0595 6.5170 5.8126 9.2744 10.8338 1.0790 1.0816 1.0793 1.0611 1.0663 1.0595 1.0579 1.0500 1.0516 1.0730 1.0552 1.0645 1.0603 1.0674 1.0902 1.0660 1.0992 1.0990 1.1002 1.0988 1.0973 1.0981 1.0979 1.1006 1.0962 1.0975 1.0977 1.1023 1.0904 1.0951 1.0947 1.0654
irintensity: 2.1404 2.7837 0.8644 0.5577 1.0221 4.6110 0.9423 0.5417 0.8703 0.7693 0.7895 0.3084 0.9137 0.2562 0.4915 0.9851 1.1064 1.9871 2.3451 8.0676 0.1036 3.7636 2.8428 71.4256 1.0286 31.6502 11.3635 62.1862 5.3420 7.1070 8.8823 2.6304 2.5451 0.7522 4.5284 4.0306 3.1343 6.0304 3.7850 2.2634 1.0893 8.1466 3.7520 10.9916 8.1573 1.1549 46.2427 7.8467 1.9468 7.8149 2.5103 9.0261 1.5805 1.0785 1.5186 15.8462 16.5486 27.7773 4.5339 1.4333 4.3904 22.9197 5.1785 17.1645 7.2190 31.8965 8.1814 3.4560 0.4991 7.4692 0.7873 12.1945 2.8067 10.9442 2.8188 2.5728 14.1477 2.8525 19.7172 12.8285 3.2799 4.7783 5.8395 14.1066 2.4516 18.9109 6.3478 31.5438 3.7116 31.7719 3.0706 5.8709 4.9708 10.4300 0.4557 3.1182 5.4764 4.6655 47.2441 0.7832 33.0992 0.8195 9.4053 8.8119 25.0415 0.5031 12.1857 7.5191 15.8523 5.4813 0.8386 5.2072 1.3754 3.6545 3.4401 2.0280 5.2900 3.4882 3.9317 2.9258 4.9108 5.0823 33.2423 10.0972 0.6074 13.7833 13.8444 4.3888 9.8758 14.0324 13.9744 12.1826 0.4123 6.5348 11.3433 11.2672 9.7826 17.7986 106.0671 31.0191 228.2257 635.5625 9.0879 28.3088 14.1587 25.0199 8.7245 7.8389 13.3466 25.0526 13.5651 13.7905 76.6766 21.6513 72.3467 35.9388 31.8964 32.6198 37.5811 45.4584 39.6496 43.4852 19.8832 75.8876 12.6761 9.1095 31.3615 21.7011 38.8335 30.6710 11.2247 2.2691 3.8854 4.2234
temp: 298.150 k
press: 1.00000 atm
elementType: 8 8 8 8 6 6 6 6 6 6 6 6 6 6 6 6 6 6 6 6 6 6 6 6 6 6 6 6 1 1 1 1 1 1 1 1 1 1 1 1 1 1 1 1 1 1 1 1 1 1 1 1 1 1 1 1 1 1 1 1
symmnumber: 1
zpe: 1342981.1 jmol-1
zpe.correction: 0.511515 hartree
zpe.thermalcorrener: 0.536982 hartree
zpe.thermalcorrenthalpy: 0.537926 hartree
zpe.thermalcorrgfe: 0.457723 hartree
zpe.sumelectzpe: -1232.514395 hartree
zpe.sumelectthermal: -1232.488928 hartree
zpe.sumelectthermalent: -1232.487983 hartree
zpe.sumelectthermalfe: -1232.568186 hartree
dipole: 3.4667 -3.4906 1.2185
dipole: 5.0683
quadrupole: -260.2919 -162.8087 -167.3442
quadrupole: 17.8571 22.9993 1.7232
quadrupole: -63.4769 34.0062 29.4707 17.8571 22.9993 1.7232
hfenergy: -1233.0259093 hartree
pointgroup: C01 [X(C24H32O4)]
dipole: -1.401821 -1.3721754 -0.3579802 debye
polarizability: 351.0440818|-5.3896654|227.2331851|-20.3495741|-3.8190159|203.9560263 unknown
InChI: InChI=1S/C24H32O4/c1-22-10-7-17(25)13-16(22)4-5-20-19(22)8-11-23(2)18(9-12-24(20,23)27)15-3-6-21(26)28-14-15/h3,6,14,16,18-20,27H,4-5,7-13H2,1-2H3
charge 0 multiplicity 1
60 atoms
O  1.189598 1.71252 -0.501445
O  -6.548377 0.148502 1.725213
O  5.387633 0.944072 -0.294679
O  7.534527 0.158612 -0.729159
C  0.327349 0.62313 0.052716
C  -1.059043 0.690893 -0.654732
C  1.065996 -0.759737 -0.083137
C  -1.998953 -0.501156 -0.283806
C  -3.385901 -0.413422 -1.033238
C  0.062868 -1.894927 0.302213
C  -1.26519 -1.850114 -0.483499
C  2.192031 -0.709764 1.045925
C  -4.051836 0.98445 -0.759689
C  0.330439 0.900517 1.569872
C  -1.748472 2.055954 -0.405514
C  1.702196 0.378699 2.071837
C  -3.106326 2.155463 -1.132634
C  -4.376642 -1.52291 -0.553854
C  1.61863 -1.018178 -1.50212
C  -3.21828 -0.611264 -2.567745
C  -4.560088 1.146622 0.709118
C  -4.829759 -1.398073 0.924991
C  3.627384 -0.494939 0.573466
C  -5.423527 -0.016946 1.181238
C  4.577324 -1.582186 0.562938
C  4.094349 0.731819 0.134468
C  5.887839 -1.421017 0.142679
C  6.398147 -0.143706 -0.321771
H  -0.850098 0.616958 -1.747224
H  -2.212876 -0.409121 0.803926
H  -0.161257 -1.834849 1.38662
H  0.563417 -2.871291 0.14291
H  -1.071546 -2.022209 -1.55968
H  -1.903542 -2.687404 -0.143747
H  2.183904 -1.701568 1.54007
H  -4.948208 1.042583 -1.413778
H  -0.507888 0.369896 2.055162
H  0.204107 1.978212 1.764002
H  -1.07769 2.872659 -0.729224
H  -1.898082 2.198162 0.682999
H  2.423878 1.211246 2.106391
H  1.638857 -0.031557 3.095269
H  -3.595979 3.118286 -0.886681
H  -2.941523 2.161613 -2.228208
H  -3.942415 -2.526274 -0.720981
H  -5.278372 -1.470141 -1.197857
H  0.81679 -1.009012 -2.262863
H  2.380437 -0.274838 -1.793792
H  2.107751 -2.008559 -1.553361
H  -4.175838 -0.40661 -3.082689
H  -2.457774 0.054256 -3.010546
H  -2.933523 -1.651595 -2.80837
H  -5.137545 2.082727 0.810075
H  -3.694052 1.218624 1.398434
H  1.225364 1.608434 -1.487039
H  -3.959886 -1.540278 1.598994
H  -5.579401 -2.16687 1.180232
H  4.246279 -2.569746 0.90942
H  3.477697 1.632636 0.068791
H  6.601496 -2.248984 0.145291
