program: Gaussian 09
title: 000099524
version: EM64L-G09RevD.01
frameworkgroup: C1[X(C15H10ClNO2)]
method: RPBEPBE
basis: SDD
operation: Freq
keyword: #p
keyword: freq=noraman
keyword: PBEPBE/SDD
title: #p freq=noraman PBEPBE/SDD
converged: NO YES NO NO
title: Mulliken charges:
elementType: Cl O O N C C C C C C C C C C C C C C C H H H H H H H H H H
charge: 0.072106 -0.451994 -0.249121 -0.265265 0.208730 0.166169 0.295958 -0.362932 0.396036 -0.336450 -0.359916 -0.221508 -0.244756 -0.345675 -0.351817 0.088055 -0.204961 -0.204914 -0.230551 0.253697 0.285112 0.225656 0.225905 0.260856 0.261816 0.236291 0.236345 0.236728 0.380399
chargesum: 0.00000
title: Mulliken charges with hydrogens summed into heavy atoms:
elementType: Cl O O N C C C C C C C C C C C C C C C
charge: 0.072106 -0.071594 -0.249121 -0.265265 0.208730 0.166169 0.295958 -0.362932 0.396036 -0.082753 -0.074804 0.004148 -0.018851 -0.084819 -0.090001 0.088055 0.031330 0.031430 0.006178
polarizability: 2.44483260e+02 -6.48805530e+00 2.01331787e+02 -1.50768169e-01 -1.28675520e+00 1.10119644e+02
1716.lowfreq: -26.8478 -5.7396 0.0022 0.0024 0.0028 5.8558 7.9936 41.3837 59.2813
frequency: -26.8065 41.2954 59.2729 60.4108 97.8013 125.4340 155.1424 182.4349 227.5526 232.8139 276.5638 300.4786 353.2700 380.1728 405.9848 413.4124 421.6479 431.3602 480.6561 557.0836 584.9495 591.2166 612.6331 617.5167 636.3353 647.3905 658.5053 699.6609 724.6473 749.2853 760.2186 772.9820 784.3179 843.0866 850.4980 870.3890 927.7849 943.2318 951.7420 980.8034 983.3540 989.0555 990.3924 1002.7166 1016.2668 1024.0286 1076.9139 1083.2784 1126.6144 1162.6308 1174.5360 1178.1950 1192.2821 1217.6288 1284.5278 1299.0622 1309.9544 1339.2321 1370.9691 1378.9571 1410.4646 1437.5920 1445.3555 1471.9323 1487.8222 1517.8798 1582.7060 1595.9508 1607.8899 1622.6685 1650.5371 3132.4281 3134.7605 3144.0496 3148.0269 3154.8520 3163.5257 3164.5741 3174.2901 3191.3613 3518.4345
redmass: 3.9109 6.6762 6.0480 13.4343 6.5668 4.7970 9.0296 9.0849 4.9346 4.6576 7.9144 6.3833 10.9300 11.0503 2.8339 6.5549 5.9176 3.2816 3.9356 1.7388 3.2472 4.8522 3.7143 6.6976 4.3258 5.8993 5.8648 1.8900 5.1304 3.0664 1.6682 3.2206 2.7794 5.7134 1.2442 1.3953 1.9479 3.1571 1.3659 1.3839 6.9593 1.3015 6.3526 1.3245 2.0413 2.1122 1.5387 2.6600 1.5961 1.3157 1.0551 1.1418 2.1244 2.2363 2.9534 1.8530 1.3326 4.8471 3.5963 9.4073 6.1519 2.1934 3.5440 3.0857 2.8434 9.2186 7.1087 6.5104 6.2448 7.7420 8.2524 1.0859 1.0854 1.0888 1.0911 1.0931 1.0974 1.0982 1.1018 1.0953 1.0639
irintensity: 0.0233 0.3738 0.6925 0.9010 0.3433 0.8361 0.2069 0.2043 1.8912 0.2782 3.1825 0.2295 0.9287 5.4132 0.0083 1.9540 0.6378 3.0386 10.8963 55.6264 17.9100 64.9685 28.8396 16.5188 51.2861 9.5548 8.2349 46.3109 2.1775 13.8734 74.4323 28.1040 36.1376 8.4898 0.1742 1.2726 1.7486 2.9034 2.9368 0.1009 193.8757 0.8252 0.2648 0.0317 9.9734 54.8065 10.9755 132.7586 59.5526 1.9184 0.0014 2.5698 0.6261 22.5267 31.6516 37.2131 0.3027 19.8992 30.7628 2.1445 7.4250 7.7892 90.4995 21.9036 80.3614 246.8001 2.7875 3.1399 22.0423 11.7687 427.9799 3.1310 0.1608 4.3968 19.0606 20.1742 14.4761 19.1943 11.3582 7.2176 42.0933
temp: 298.150 k
press: 1.00000 atm
elementType: 17 8 8 7 6 6 6 6 6 6 6 6 6 6 6 6 6 6 6 1 1 1 1 1 1 1 1 1 1
symmnumber: 1
zpe: 552481.4 jmol-1
zpe.correction: 0.210429 hartree
zpe.thermalcorrener: 0.225054 hartree
zpe.thermalcorrenthalpy: 0.225999 hartree
zpe.thermalcorrgfe: 0.167853 hartree
zpe.sumelectzpe: -1241.566896 hartree
zpe.sumelectthermal: -1241.552271 hartree
zpe.sumelectthermalent: -1241.551327 hartree
zpe.sumelectthermalfe: -1241.609473 hartree
dipole: 3.6144 2.8484 0.0350
dipole: 4.6019
quadrupole: -92.4871 -122.8543 -111.7901
quadrupole: -3.6286 -0.0577 -0.6109
quadrupole: 16.5567 -13.8105 -2.7463 -3.6286 -0.0577 -0.6109
hfenergy: -1241.7773254 hartree
pointgroup: C01 [X(C15H10Cl1N1O2)]
dipole: 1.4080113 -1.137578 -0.0386825 debye
polarizability: 244.5985463|5.94755|201.1846599|-2.1436225|-1.3101134|110.1514844 unknown
InChI: InChI=1S/C15H10ClNO2/c16-14-13(15(18)19)11-8-4-5-9-12(11)17(14)10-6-2-1-3-7-10/h1-9,18H
charge 0 multiplicity 1
29 atoms
Cl 0.266371 2.911894 0.059599
O  -4.137399 1.056415 0.111376
O  -2.906019 3.02645 0.112589
N  0.432864 0.170481 0.0374
C  -0.36894 -0.998506 0.041704
C  -1.744206 -0.591474 0.064434
C  -1.764139 0.869347 0.074014
C  -0.41851 1.274724 0.057079
C  1.879319 0.185406 0.010003
C  0.034786 -2.348488 0.025595
C  -2.751484 -1.590576 0.071078
C  -0.985706 -3.321403 0.032769
C  -2.359654 -2.944304 0.055269
C  2.552346 0.253268 -1.23091
C  2.60025 0.109957 1.223249
C  -2.914566 1.76943 0.099935
C  3.96473 0.252612 -1.254499
C  4.012626 0.108396 1.191551
C  4.695261 0.18018 -0.045309
H  1.092509 -2.628835 0.007634
H  -3.803581 -1.298856 0.088703
H  -0.716974 -4.383378 0.020501
H  -3.126678 -3.726543 0.060053
H  1.972483 0.309774 -2.157867
H  2.056964 0.058465 2.172446
H  4.491759 0.309721 -2.212772
H  4.576627 0.054159 2.128715
H  5.790432 0.181179 -0.066699
H  -4.873068 1.726705 0.127762
