program: Gaussian 09
title: 000010836
version: EM64L-G09RevD.01
frameworkgroup: C1[X(C10H15N)]
method: RPBEPBE
basis: SDD
operation: Freq
keyword: #pfreq=noraman
keyword: PBEPBE/SDD
title: #p freq=noraman PBEPBE/SDD
converged: YES YES NO NO
title: Mulliken charges:
elementType: N C C C C C C C C C C H H H H H H H H H H H H H H H
charge: -0.331781 -0.033369 -0.572791 0.497892 -0.740736 -0.397627 -0.422623 -0.636019 -0.231896 -0.229555 -0.244481 0.199869 0.214438 0.221563 0.244559 0.219013 0.206626 0.265900 0.230326 0.234010 0.220427 0.223872 0.191540 0.221981 0.222698 0.226166
chargesum: 0.00000
title: Mulliken charges with hydrogens summed into heavy atoms:
elementType: N C C C C C C C C C C
charge: -0.065880 0.166500 -0.136791 0.497892 -0.070538 -0.167302 -0.188613 -0.000180 -0.009915 -0.006857 -0.018315
polarizability: 1.49163153e+02 -3.79752166e+00 1.07866639e+02 -8.16842664e+00 -1.12496430e+01 7.80996925e+01
1716.lowfreq: -8.2633 -0.0006 -0.0003 0.0005 8.3337 15.2264 33.9864 56.4983 89.5707
frequency: 33.7856 56.2178 89.4798 98.5411 201.3225 213.1856 237.3183 247.0443 347.8042 361.1257 385.6589 404.0855 458.7344 503.2808 572.6284 611.4985 618.5661 705.9914 746.6954 817.6285 833.3212 853.3413 884.4580 912.8984 927.0549 974.3335 989.6310 992.1240 1026.9435 1036.0502 1053.8310 1070.0977 1095.0172 1108.5410 1152.0964 1170.9750 1187.4882 1205.7505 1208.1682 1224.3071 1272.1737 1321.4860 1333.0988 1336.5981 1381.1306 1383.0955 1437.1817 1438.9006 1449.0918 1465.7004 1466.4122 1477.0355 1480.7238 1483.9339 1495.1705 1590.8207 1613.6213 2839.8832 2868.3163 2974.3996 2989.9385 3014.9683 3052.4707 3064.2291 3073.8692 3094.7947 3112.1309 3115.4999 3130.0978 3141.0999 3160.0688 3464.5016
redmass: 3.1673 3.2805 3.3642 1.9512 1.3714 1.3901 2.6694 1.8954 2.3024 2.8855 2.1539 2.8267 2.5726 2.7538 2.1954 2.6119 5.2777 1.8397 1.8090 3.6757 2.1706 1.2483 1.4131 1.5389 1.6946 1.3860 6.1144 1.3136 2.1906 1.5137 2.1385 1.7823 1.4376 1.3357 3.3817 1.0543 1.1211 1.8998 1.6119 2.2109 1.3790 1.3336 1.3622 1.2846 7.7934 1.2481 1.3982 1.6390 1.2064 1.0736 1.0841 1.0732 1.1332 2.0203 1.0483 6.0188 6.1435 1.0813 1.0567 1.0367 1.0602 1.0746 1.1015 1.0990 1.0988 1.0982 1.0863 1.0866 1.0911 1.0959 1.1015 1.0750
irintensity: 0.3556 0.0720 0.7209 1.3560 0.0696 0.7626 2.7971 0.6301 4.8527 11.6145 13.4108 0.0111 8.4902 16.4933 85.7596 32.3568 5.4630 46.7171 48.8212 1.8617 4.9471 0.0985 1.3405 1.5344 3.2473 0.1228 0.0080 0.1571 6.3393 0.9980 10.0828 17.3912 10.4848 2.2155 37.2070 0.2583 0.3375 19.9144 0.7680 13.0170 5.2290 3.2851 6.0498 31.9162 0.2474 26.9906 8.9884 2.6561 15.6052 1.0225 4.7414 5.5699 17.7601 15.7837 15.5010 1.3132 10.1796 66.5063 139.2797 33.1539 24.8953 50.8027 15.4061 43.8736 44.1000 27.0357 9.9578 4.9847 13.2877 49.2701 23.6692 0.9683
temp: 298.150 k
press: 1.00000 atm
elementType: 7 6 6 6 6 6 6 6 6 6 6 1 1 1 1 1 1 1 1 1 1 1 1 1 1 1
symmnumber: 1
zpe: 592985.7 jmol-1
zpe.correction: 0.225856 hartree
zpe.thermalcorrener: 0.237346 hartree
zpe.thermalcorrenthalpy: 0.238290 hartree
zpe.thermalcorrgfe: 0.187781 hartree
zpe.sumelectzpe: -443.958757 hartree
zpe.sumelectthermal: -443.947267 hartree
zpe.sumelectthermalent: -443.946323 hartree
zpe.sumelectthermalfe: -443.996832 hartree
dipole: 0.6885 -0.2500 1.0411
dipole: 1.2730
quadrupole: -61.4536 -63.9993 -70.3717
quadrupole: -2.0876 1.9189 -1.6344
quadrupole: 3.8212 1.2756 -5.0968 -2.0876 1.9189 -1.6344
hfenergy: -444.1846129 hartree
pointgroup: C01 [X(C10H15N1)]
dipole: -0.2637658 -0.0830827 -0.417549 debye
dipolederiv: -0.7253945 -0.1262143 0.1121553 -0.0558829 -0.5758461 -0.1108893 0.2743238 -0.1351927 -0.4400227 0.8317139 0.0758348 -0.0801976 -0.0403157 0.2226523 0.0532339 0.1468108 0.0495431 0.3286923 -0.227953 -0.0193625 -0.0236134 0.0225999 0.0987471 0.0352711 -0.2234625 0.0558962 0.0433044 0.4243181 -0.0248488 -0.0458791 0.001575 -0.0420944 -0.0089756 -0.1725874 -0.0000793 -0.0593554 -0.0580701 -0.0654203 0.0159469 -0.058017 -0.0712879 0.0739921 0.0232209 0.0948401 0.0560471 -0.109663 0.0676676 -0.002831 0.1462027 -0.0026736 0.0575173 0.0898969 0.0679351 -0.1344652 -0.1952798 -0.0190265 -0.0422462 -0.0752199 0.0132571 0.1073637 -0.0380803 0.0920524 -0.0996582 0.1303631 0.03008 0.004424 0.1672015 0.4862531 0.0905213 -0.0453226 0.0464917 0.3036089 -0.0164608 -0.0132149 -0.0452685 -0.0525588 0.0500295 0.1109977 -0.0614336 0.112458 -0.0754644 0.0433102 0.0720754 -0.0061841 0.0801001 0.0415498 0.0818248 -0.0124583 0.0865344 -0.0989106 0.0381178 0.0107308 -0.070286 0.0301701 -0.1160373 0.0318748 -0.0424455 0.0304464 -0.1439247 -0.0816179 -0.0022736 0.0587018 0.1047133 -0.1018069 -0.1426207 0.0862375 -0.0719519 -0.14185 0.0313464 -0.0193162 0.042832 -0.0491848 -0.1106557 0.1070689 0.0583388 0.0636331 0.0279616 0.0217081 0.0135049 0.0110287 0.0329407 -0.0244225 -0.1339583 0.0345554 -0.0767354 -0.0278882 -0.0918643 -0.0760941 0.0719174 -0.0706938 0.0702509 -0.0038199 0.0821413 -0.0098066 0.0837332 0.0805842 0.058274 0.0319708 0.0377176 -0.0157442 -0.0650197 0.0594088 -0.1419277 -0.0429482 -0.033395 0.0633889 -0.1468205 0.026932 0.0555188 0.0310352 -0.1499248 0.0619996 -0.0839535 0.0488877 -0.0045005 -0.0626808 -0.0539962 0.1292775 0.087655 -0.1977818 0.1708225 0.1291603 0.0048087 -0.1198081 -0.0156334 -0.1120816 -0.013235 -0.0542103 -0.0213328 -0.0507948 0.1106485 0.0567346 0.0720087 0.0725849 0.0531895 -0.0193854 -0.0946792 0.0656733 -0.1011404 0.0747662 -0.210433 -0.0677068 0.0574716 -0.0040582 0.063521 0.0047442 0.0411985 -0.0124125 0.099875 0.0701213 0.0999064 -0.118041 0.0281864 -0.0199341 0.0667413 -0.1027904 0.0922921 -0.0753373 0.0607833 0.0483504 0.0752 -0.1005709 -0.1565287 -0.108559 -0.0178486 -0.2056771 -0.1607033 0.0426253 0.0548195 0.0540271 0.0691455 -0.0356206 -0.1150396 0.0695715 -0.1152395 0.0785189 -0.0057075 -0.1030454 -0.0197433 -0.1215201 -0.0285848 -0.0718803 -0.0216842 -0.072401 0.1210075 -0.1295837 -0.0058094 0.0711645 -0.0065744 0.1027999 -0.0301893 0.0757755 -0.0315857 0.1271578 unknown
polarizability: 148.7897932|6.2582449|106.7135457|-7.9361573|12.8260422|79.6261454 unknown
InChI: InChI=1S/C10H15N/c1-9(11-2)8-10-6-4-3-5-7-10/h3-7,9,11H,8H2,1-2H3
charge 0 multiplicity 1
26 atoms
N  -3.259871 0.027572 0.036142
C  -1.850062 0.235148 -0.368584
C  -0.900895 -0.061689 0.837276
C  0.571105 -0.072039 0.458016
C  -1.67804 1.679457 -0.876833
C  1.120039 -1.157723 -0.275978
C  1.428223 1.005371 0.801732
C  -3.713602 -1.371003 0.131072
C  2.480572 -1.166171 -0.656247
C  2.791466 1.001738 0.426068
C  3.322859 -0.084333 -0.306883
H  -1.56341 -0.46526 -1.19601
H  -1.181302 -1.045399 1.260555
H  -1.106332 0.695145 1.616814
H  -0.626903 1.878463 -1.144776
H  -1.982446 2.396292 -0.091144
H  -2.299699 1.862013 -1.774462
H  -3.898992 0.603634 -0.525071
H  0.477192 -2.007404 -0.539903
H  1.022983 1.850122 1.372667
H  -4.797743 -1.393357 0.341093
H  -3.210631 -1.886869 0.969581
H  -3.525261 -1.973457 -0.792418
H  2.885721 -2.015353 -1.218887
H  3.437161 1.842079 0.706404
H  4.379466 -0.090675 -0.597724
