program: Gaussian 09
title: 000099497
version: EM64L-G09RevD.01
frameworkgroup: C1[X(C12H15N5O4)]
method: RPBEPBE
basis: SDD
operation: Freq
keyword: #p
keyword: freq=noraman
keyword: PBEPBE/SDD
title: #p freq=noraman PBEPBE/SDD
converged: YES YES NO NO
title: Mulliken charges:
elementType: O O O O N N N N N C C C C C C C C C C C C H H H H H H H H H H H H H H H
charge: -0.432492 -0.125574 -0.235333 -0.192921 -0.082386 -0.148743 -0.083167 0.006379 0.014858 -0.370868 -0.354649 -0.417028 -0.391362 -0.347986 0.469167 -0.067355 -0.321424 -0.373275 -0.051109 -0.420853 0.389600 0.203952 0.230270 0.217631 0.197938 0.298404 0.233722 0.241970 0.220526 0.177196 0.232557 0.237838 0.184630 0.234572 0.290425 0.334891
chargesum: 0.00000
title: Mulliken charges with hydrogens summed into heavy atoms:
elementType: O O O O N N N N N C C C C C C C C C C C C
charge: -0.097601 -0.125574 -0.235333 -0.192921 -0.082386 -0.148743 -0.083167 0.006379 0.014858 0.063355 0.060920 0.115098 0.071134 0.061767 0.469167 -0.067355 0.101044 -0.138703 -0.051109 -0.130428 0.389600
polarizability: 3.44694571e+02 -9.92450669e+00 1.86482618e+02 -1.77058024e+01 -2.35183422e+00 1.04101041e+02
1716.lowfreq: -7.4029 -0.0009 -0.0008 -0.0006 3.1942 8.8954 17.8271 39.4970 48.1349
frequency: 16.4357 39.1750 48.0425 53.8400 66.6924 73.3950 96.0328 133.9443 162.6950 182.1774 208.8316 225.2696 235.7926 244.5735 286.2551 308.0937 325.0828 339.4329 348.4234 371.0560 404.9386 420.2341 432.7038 468.9565 509.6720 513.9620 568.1870 571.2781 588.5351 614.5774 629.3457 660.3449 678.2146 710.4929 714.5187 741.1818 777.2225 798.8379 812.8735 836.3709 850.4648 866.7333 930.0829 943.9149 965.5950 976.7018 989.0642 997.7142 1032.0407 1042.1799 1045.8750 1066.2496 1085.1876 1106.8730 1130.5486 1146.7782 1158.8781 1162.8030 1200.3626 1211.8435 1223.2406 1257.0625 1265.0389 1282.2891 1293.3742 1295.7983 1309.1849 1311.2553 1324.0315 1339.7150 1349.1286 1352.8954 1354.7414 1370.7671 1384.3927 1399.5150 1425.5474 1446.6240 1451.4032 1456.3433 1461.3124 1465.3402 1471.5179 1481.1952 1513.5961 1564.7923 1585.1872 2843.3915 2855.3794 2876.7296 2958.7956 2976.3790 2985.7708 3045.2967 3050.3060 3052.1936 3100.3427 3102.3597 3106.0749 3166.4957 3189.2172 3559.1666
redmass: 6.4275 3.6139 3.5507 7.5319 4.2261 3.8558 4.1763 5.0257 10.3292 4.9340 7.1786 4.1291 2.8825 3.5113 2.7901 1.5171 2.6866 4.0605 3.2670 4.0549 2.9412 4.1728 7.7278 2.6812 6.7645 5.5036 6.8469 6.6096 4.3833 5.4320 3.1157 4.7948 8.6046 9.2553 8.8001 8.6286 3.6588 1.1741 1.5117 1.6550 10.4123 4.7399 11.3898 2.6021 3.3845 1.3347 8.0819 2.7844 2.6736 1.6880 2.1194 2.3356 2.2289 2.4025 2.2942 2.5020 1.9046 3.3217 1.1388 2.2330 2.9357 1.7598 1.2652 2.6123 2.3578 1.1619 1.4627 1.7267 2.6216 1.3369 2.1150 1.7624 1.5985 1.3713 1.4257 1.4153 2.8692 6.7471 1.0877 1.0811 1.1244 1.1099 1.0975 1.0887 4.8885 7.3475 7.2345 1.0712 1.0709 1.0702 1.0701 1.0672 1.0672 1.0882 1.0875 1.0901 1.0969 1.0958 1.0945 1.0890 1.0928 1.0663
irintensity: 3.0469 0.4835 4.1997 0.2389 3.0324 1.0277 6.8778 0.5788 0.8743 1.6266 0.8780 1.8101 3.2753 0.5492 15.1942 81.7702 78.3572 5.6139 12.1437 6.9923 2.4097 7.7097 1.7348 0.7616 2.3311 1.4540 2.2805 8.6426 9.9782 2.1790 12.2572 2.1831 14.9837 7.5272 7.1598 5.2265 2.9292 4.8334 44.3151 0.4584 14.5032 19.7256 22.3999 3.0903 122.2078 5.0662 1.2767 126.7455 26.6737 12.9850 3.9346 13.3072 11.1994 0.7085 23.5392 64.7086 12.0104 113.9384 6.1762 167.8777 614.1528 50.1676 7.4684 18.5436 25.5155 9.8280 5.6656 103.2570 1.8756 51.8458 55.3459 30.4933 16.3869 2.5555 3.5990 0.7245 20.0316 56.1611 26.0593 0.5591 31.1556 7.7716 4.7602 9.2743 15.2649 479.3494 225.5457 66.7188 83.1591 98.9150 61.4843 41.9184 50.4173 1.4852 49.6238 38.3282 11.2510 23.2958 13.4175 2.6320 10.5230 11.7760
temp: 298.150 k
press: 1.00000 atm
elementType: 8 8 8 8 7 7 7 7 7 6 6 6 6 6 6 6 6 6 6 6 6 1 1 1 1 1 1 1 1 1 1 1 1 1 1 1
symmnumber: 1
zpe: 720336.0 jmol-1
zpe.correction: 0.274361 hartree
zpe.thermalcorrener: 0.293355 hartree
zpe.thermalcorrenthalpy: 0.294299 hartree
zpe.thermalcorrgfe: 0.225027 hartree
zpe.sumelectzpe: -1039.164514 hartree
zpe.sumelectthermal: -1039.145521 hartree
zpe.sumelectthermalent: -1039.144576 hartree
zpe.sumelectthermalfe: -1039.213849 hartree
dipole: -9.6166 -3.3013 0.0357
dipole: 10.1676
quadrupole: -189.6103 -125.3393 -118.0965
quadrupole: 2.7459 14.2753 1.1385
quadrupole: -45.2616 19.0094 26.2522 2.7459 14.2753 1.1385
hfenergy: -1039.4388755 hartree
pointgroup: C01 [X(C12H15N5O4)]
dipole: -3.7687769 -1.1988444 0.6007542 debye
polarizability: 343.0369663|-17.3069097|176.0045768|-22.8470071|-26.9834863|116.2366861 unknown
InChI: InChI=1S/C12H15N5O4/c18-8-7-15-3-5-16(6-4-15)9-1-2-10(17(19)20)12-11(9)13-21-14-12/h1-2,18H,3-8H2
charge 0 multiplicity 1
36 atoms
O  -7.567923 -0.448484 -0.293187
O  2.141854 2.55534 -1.325102
O  5.162973 -2.134094 0.023805
O  5.458127 -0.056818 -0.898432
N  -3.823077 0.112607 0.042862
N  -0.947668 -0.07054 0.400639
N  0.925899 1.994266 -0.824991
N  3.26793 1.646384 -1.173591
N  4.718804 -0.974404 -0.362768
C  -2.927032 1.16959 -0.482337
C  -3.131976 -1.193522 0.001123
C  -1.642325 1.245801 0.361665
C  -1.843135 -1.164451 0.849963
C  -5.162306 0.099748 -0.591753
C  0.411228 -0.251506 0.238522
C  1.27534 0.764245 -0.365051
C  -6.236702 -0.525237 0.323472
C  1.085544 -1.447529 0.616461
C  2.710083 0.54949 -0.579967
C  2.469969 -1.651685 0.409064
C  3.303316 -0.692431 -0.183051
H  -2.653254 0.996181 -1.552984
H  -3.443215 2.143806 -0.41651
H  -3.792311 -1.977824 0.411381
H  -2.864985 -1.486182 -1.047131
H  -0.971041 2.014488 -0.044696
H  -1.917677 1.515196 1.40172
H  -2.107832 -1.009678 1.915157
H  -1.341043 -2.136997 0.74663
H  -5.15317 -0.432812 -1.578821
H  -5.464322 1.143088 -0.794486
H  -6.317753 0.05781 1.253477
H  -5.983976 -1.574049 0.587892
H  0.537469 -2.246179 1.118935
H  2.935476 -2.58948 0.727384
H  -7.578191 -0.992739 -1.121095
