program: Gaussian 09
title: 000099466
version: EM64L-G09RevD.01
frameworkgroup: C1[X(C9H5Cl2NOS2)]
method: RPBEPBE
basis: SDD
operation: Freq
keyword: #p
keyword: freq=noraman
keyword: PBEPBE/SDD
title: #p freq=noraman PBEPBE/SDD
converged: YES YES NO NO
title: Mulliken charges:
elementType: Cl Cl S S O N C C C C C C C C C H H H H H
charge: 0.001338 0.009984 0.326112 0.178747 -0.177081 -0.211513 0.522601 0.271775 -0.780588 -0.591137 -0.311948 -0.342132 -0.040537 -0.176376 -0.113809 0.307184 0.309471 0.293418 0.259978 0.264513
chargesum: 0.00000
title: Mulliken charges with hydrogens summed into heavy atoms:
elementType: Cl Cl S S O N C C C C C C C C C
charge: 0.001338 0.009984 0.326112 0.178747 -0.177081 -0.211513 0.522601 0.271775 -0.163934 -0.591137 -0.018531 -0.082154 -0.040537 0.088136 -0.113809
polarizability: 2.23864623e+02 1.09827473e+01 1.60270727e+02 -8.43822869e+00 -3.49280003e+00 9.83942058e+01
1716.lowfreq: -0.0023 0.0009 0.0024 2.0678 4.6528 9.2794 27.5212 48.1705 55.5425
frequency: 27.5047 48.1630 55.5405 102.9110 116.6891 128.4157 177.1680 200.1033 207.1386 270.9128 286.8152 346.9187 394.6959 395.8353 442.3606 445.8554 463.1573 505.4627 518.8869 532.5203 578.8180 605.2246 660.4128 690.8449 711.5605 728.1391 805.9383 823.7903 881.0448 892.0663 944.3209 958.0279 1002.9954 1017.4356 1115.6288 1119.3830 1143.2051 1159.8604 1215.7204 1231.3099 1246.4168 1305.8865 1369.0524 1386.7104 1423.8704 1458.7419 1577.0475 1594.2254 1647.2288 3049.5622 3121.7284 3167.4043 3182.9826 3186.4941
redmass: 12.0085 13.9746 15.8080 11.2781 3.3394 6.0461 24.5258 8.1048 14.7701 11.8472 17.1199 7.0335 11.6068 17.4551 3.2052 5.8931 9.9430 18.0694 6.0850 5.4295 5.7054 4.7202 7.0542 5.5491 4.9024 5.7064 1.9689 2.6544 1.5412 1.6288 1.9069 2.8761 7.1630 6.1501 1.9798 1.1730 1.6277 3.9036 5.8378 1.4021 1.3866 5.4432 6.8323 3.8768 1.0776 2.8587 8.5986 6.7781 12.5698 1.0571 1.1066 1.0891 1.0937 1.0976
irintensity: 0.2757 0.5365 0.9858 4.3773 4.7438 1.1531 0.4429 1.1831 0.8872 0.1135 0.2952 1.2961 2.3544 6.7267 6.4442 1.2755 41.6434 2.5600 5.6141 5.5107 20.7107 2.6511 6.2129 11.7900 18.0267 11.0789 24.6445 33.1428 8.7146 11.6587 7.1616 6.9130 18.5630 62.8227 32.4272 0.6532 13.9503 141.8793 417.5087 68.5728 1.7605 98.5432 1.5596 17.2317 17.2196 145.8329 17.1026 10.9680 225.3668 3.7414 0.0011 1.0745 0.5978 1.4543
temp: 298.150 k
press: 1.00000 atm
elementType: 17 17 16 16 8 7 6 6 6 6 6 6 6 6 6 1 1 1 1 1
symmnumber: 1
zpe: 315037.4 jmol-1
zpe.correction: 0.119991 hartree
zpe.thermalcorrener: 0.133888 hartree
zpe.thermalcorrenthalpy: 0.134832 hartree
zpe.thermalcorrgfe: 0.076771 hartree
zpe.sumelectzpe: -2191.122327 hartree
zpe.sumelectthermal: -2191.108431 hartree
zpe.sumelectthermalent: -2191.107486 hartree
zpe.sumelectthermalfe: -2191.165548 hartree
dipole: -2.7333 -2.1915 0.0144
dipole: 3.5034
quadrupole: -110.3344 -120.6040 -113.6544
quadrupole: 5.5134 -6.0680 8.5609
quadrupole: 4.5299 -5.7397 1.2098 5.5134 -6.0680 8.5609
hfenergy: -2191.2423186 hartree
pointgroup: C01 [X(C9H5Cl2N1O1S2)]
dipole: -1.1109136 -0.8148612 -0.0417378 debye
dipolederiv: -0.2833057 -0.206806 -0.1708448 -0.2871385 -0.3274959 -0.2451056 -0.2130787 -0.2173726 -0.1996541 -0.799015 0.1225338 0.0079001 0.1146956 -0.0620055 -0.0182548 0.0254296 -0.0158745 -0.0308746 -0.6237775 -0.1443266 0.1179677 -0.0848907 -0.011937 0.0388935 0.1273366 0.0292327 0.0010597 -0.4178693 -0.2216522 0.156678 -0.21058 -0.5395791 0.2874312 0.0991153 0.2743616 -0.242568 -0.470667 0.2502665 -0.1456958 -0.0504999 -1.0076142 0.3852048 0.0758962 0.3481478 -0.4744529 -0.9618125 -0.1616784 0.1092858 0.1559325 -1.3269169 0.6498855 -0.0114565 0.6380106 -0.400637 0.7540366 -0.1281307 0.0712629 -0.0106282 0.0671687 0.1392372 0.0249404 0.0805179 0.1077787 0.8440772 0.181561 -0.1249363 0.423375 1.3661081 -0.6510461 -0.2199891 -0.6065003 0.5262064 -0.4807443 0.0621266 0.0065397 -0.0598658 0.1689878 -0.0311752 0.0362101 -0.0463756 0.1193897 1.2635862 0.0782621 -0.144719 -0.0748966 1.166048 -0.80584 -0.1364043 -0.7063322 0.2428302 -0.1713419 -0.1515941 -0.103242 -0.0897233 -0.1016541 -0.0702474 0.0411354 -0.108241 -0.0865052 -0.0257294 0.0664425 0.0236204 -0.0156947 -0.0113363 0.035077 -0.0957499 0.0318997 -0.0796088 0.1508581 0.5062748 0.3367919 0.4538426 0.460627 0.3913028 0.3203742 0.3499328 0.2448515 -0.2976457 0.0092326 -0.0110489 -0.0377083 -0.005407 0.0414026 -0.053676 0.0382527 -0.0567107 1.1281534 -0.2971667 -0.102225 -0.188892 -0.0349567 -0.0145923 -0.045007 -0.0070491 -0.071721 0.0995592 -0.0001269 -0.0326939 -0.0506056 -0.0295163 -0.0014892 -0.0362727 -0.0113547 0.0746505 0.1197039 0.0273275 0.0073254 -0.0106158 0.0454754 0.0440682 0.0525491 0.0426469 -0.0064143 0.0871465 0.0310538 0.0228997 0.0468513 0.0630256 -0.0403836 0.0328401 -0.0184053 0.1146901 0.035604 -0.0615005 -0.0418231 -0.0598734 0.0742938 -0.0612492 -0.0415417 -0.0266184 0.1027125 0.0491833 0.037901 0.0169574 0.0369158 0.0466846 -0.0731194 0.0173489 -0.068879 0.1149774 unknown
polarizability: 225.2786592|8.3431875|158.8162113|2.2778651|-6.3046717|98.4346848 unknown
InChI: InChI=1S/C9H5Cl2NOS2/c10-6-2-1-5(3-7(6)11)12-8(13)4-15-9(12)14/h1-3H,4H2
charge 0 multiplicity 1
20 atoms
Cl 3.224022 1.833328 1.442492
Cl 4.624707 -0.691516 -0.134147
S  -3.866041 0.931616 -0.438239
S  -1.350784 2.399011 -1.420714
O  -1.748998 -2.1408 0.943642
N  -1.405819 -0.047296 -0.111496
C  0.037251 -0.185275 -0.127346
C  -2.209287 -1.085041 0.456318
C  -3.695734 -0.748321 0.398885
C  -2.05765 1.0843 -0.656308
C  0.8304 0.757359 0.559887
C  0.627125 -1.274036 -0.803922
C  2.229998 0.609616 0.558578
C  2.028842 -1.416798 -0.794081
C  2.831399 -0.475396 -0.116932
H  -4.232319 -1.515153 -0.181445
H  -4.106738 -0.706338 1.419606
H  0.371528 1.597912 1.085619
H  0.005505 -2.00578 -1.32588
H  2.505093 -2.25409 -1.311116
