program: Gaussian 09
title: 000099464
version: EM64L-G09RevD.01
frameworkgroup: C1[X(C7H15NO3)]
method: RPBEPBE
basis: SDD
operation: Freq
keyword: #p
keyword: freq=noraman
keyword: PBEPBE/SDD
title: #p freq=noraman PBEPBE/SDD
converged: YES YES NO NO
title: Mulliken charges:
elementType: O O O N C C C C C C C H H H H H H H H H H H H H H H
charge: -0.260448 -0.468755 -0.287032 -0.613237 -0.220237 -0.034722 0.009472 -0.440082 -0.025937 -0.731422 -0.500014 0.271655 0.176504 0.221507 0.217109 0.202771 0.211374 0.219470 0.214348 0.246661 0.271093 0.289711 0.361542 0.229371 0.235074 0.204222
chargesum: 0.00000
title: Mulliken charges with hydrogens summed into heavy atoms:
elementType: O O O N C C C C C C C
charge: -0.260448 -0.107213 -0.287032 -0.052432 0.051418 0.141782 0.230980 -0.020202 0.185437 -0.050944 0.168653
polarizability: 1.00186122e+02 -4.49025781e-01 9.57022579e+01 8.17898901e-02 -1.79956860e+00 7.87718326e+01
1716.lowfreq: -14.0907 -0.0003 0.0006 0.0006 9.9769 15.2133 78.2086 92.4369 112.2797
frequency: 78.1908 92.4353 112.2714 128.9063 183.1519 211.2555 234.8951 252.7932 271.3249 294.8998 304.1275 346.0717 380.3286 428.7333 447.1518 475.5447 529.5171 568.7885 632.3693 705.1945 716.6364 775.2435 829.1169 847.9135 887.3185 937.7350 981.3063 1003.1976 1033.1488 1046.9960 1062.0103 1078.6192 1102.5153 1114.3319 1124.8910 1143.0415 1158.4487 1172.8627 1205.9222 1256.4378 1284.8856 1292.1972 1307.8456 1319.7563 1321.3170 1333.6839 1341.5657 1385.5670 1394.4126 1408.7875 1429.2633 1445.6615 1454.2428 1465.0337 1475.0295 1478.8819 1635.3291 2904.4744 2952.8754 2984.3143 2990.4893 2993.5821 3002.7777 3029.9702 3046.9407 3069.3960 3091.6749 3105.8634 3114.0986 3371.3555 3440.8300 3570.6163
redmass: 3.9876 2.8282 2.3702 1.6390 2.1956 1.0853 2.9378 3.2991 3.1380 1.2387 3.2016 2.6215 3.4677 3.9146 3.2143 3.0641 3.5663 4.4979 1.1321 1.5462 3.0979 2.8089 3.9150 2.3915 2.4149 2.1253 2.0713 4.6487 2.9279 2.6198 1.7884 2.8738 1.9725 1.3517 2.4197 1.4886 2.2304 1.6011 1.6366 1.1947 1.2561 1.3241 1.4878 1.2900 1.2610 1.2227 1.3279 1.2569 1.3234 1.7683 1.1435 1.1010 1.0520 1.0484 1.0591 1.0525 1.0946 1.0819 1.0356 1.0792 1.0851 1.0356 1.0689 1.0845 1.0985 1.1014 1.0999 1.0995 1.1012 1.0638 1.0459 1.0964
irintensity: 1.7758 1.4621 2.2614 4.2077 12.1964 0.4479 7.0328 7.8674 3.9122 10.5290 6.8298 5.6302 6.6304 0.9465 7.3657 4.7522 6.0774 6.2853 113.8230 221.8691 19.4715 9.1722 61.3821 25.6548 34.6131 32.7946 3.4609 129.3681 127.4488 18.6900 30.0603 73.0594 20.7164 2.3803 41.0885 3.2131 1.8502 30.7942 0.6818 35.5677 12.4913 8.9939 9.3901 4.5407 18.1777 18.7393 0.2970 31.4636 2.4442 28.8620 6.3128 12.2942 9.0760 14.1273 4.4982 10.1468 41.5763 52.3003 69.8021 33.6929 29.1964 24.0366 56.6493 19.3272 45.1224 31.5681 38.8531 14.3834 25.4703 57.3905 0.3484 3.3179
temp: 298.150 k
press: 1.00000 atm
elementType: 8 8 8 7 6 6 6 6 6 6 6 1 1 1 1 1 1 1 1 1 1 1 1 1 1 1
symmnumber: 1
zpe: 583767.8 jmol-1
zpe.correction: 0.222345 hartree
zpe.thermalcorrener: 0.234559 hartree
zpe.thermalcorrenthalpy: 0.235504 hartree
zpe.thermalcorrgfe: 0.184997 hartree
zpe.sumelectzpe: -555.227595 hartree
zpe.sumelectthermal: -555.215381 hartree
zpe.sumelectthermalent: -555.214437 hartree
zpe.sumelectthermalfe: -555.264944 hartree
dipole: -0.8807 -2.9468 0.9817
dipole: 3.2285
quadrupole: -64.1875 -64.1952 -67.4234
quadrupole: -7.4411 4.5831 -1.9491
quadrupole: 1.0812 1.0735 -2.1547 -7.4411 4.5831 -1.9491
hfenergy: -555.4499409 hartree
pointgroup: C01 [X(C7H15N1O3)]
dipole: -0.3022715 1.1888936 -0.3294769 debye
dipolederiv: -0.7574454 0.2384877 0.0141696 0.3659921 -0.9217397 -0.0216183 0.0253071 0.1196137 -0.4585363 -0.7381431 0.1421807 -0.1216001 0.1878752 -0.4795266 0.0336724 -0.1631563 -0.0148033 -0.5757175 -0.9549214 0.0266249 0.27122 -0.0098604 -0.5498163 0.038763 0.4968115 -0.08757 -0.6532462 -0.8196916 -0.0451693 -0.2002559 -0.0085081 -0.548944 0.0850734 -0.2074512 0.0633223 -0.241093 0.4724248 0.0951576 0.0702999 0.2469947 0.2784232 0.0281615 0.0928012 -0.0119091 0.1330327 0.3979727 -0.0542431 0.0915436 -0.157417 0.0859487 -0.0297292 0.0734174 0.0406036 0.469444 0.5387627 -0.1650829 0.0240234 -0.1677792 0.4806901 -0.0768548 0.1238237 -0.182368 0.3252328 -0.2573872 -0.1281573 -0.0520591 -0.0277039 -0.059531 0.059811 -0.0688449 -0.0341324 0.070307 0.8515625 -0.1161372 -0.1903255 -0.3685993 0.9438839 0.049217 -0.5462358 0.1048569 0.7558813 -0.0085243 0.0233345 -0.0221451 0.05522 -0.1635466 -0.0096785 -0.0255507 -0.0100984 0.0693191 0.6599664 -0.0030629 -0.1040185 0.1283753 0.2848168 -0.0960979 -0.0350502 -0.0366145 0.2579757 0.0473739 -0.0136347 0.0322992 -0.0053663 0.0502223 0.0081994 0.0414823 -0.0122081 -0.0889411 -0.0243798 0.0068263 0.0443539 0.0103817 0.0068308 0.0199811 0.0309938 0.0086188 -0.2401052 -0.0158072 0.0248139 0.0480847 0.0066596 0.0118237 -0.0526872 0.025881 0.0242524 -0.1482163 0.0594487 0.0431663 -0.0047411 0.0690583 -0.159475 -0.0127172 -0.0075822 -0.0553436 0.0758423 -0.0109902 -0.0203029 0.0988224 -0.0050261 0.0888519 -0.0276317 0.055371 0.0263011 -0.1229644 -0.1398477 0.0600101 -0.127926 0.0551344 -0.0220494 0.0151758 -0.0442815 0.0444534 -0.1035229 -0.080044 -0.1565457 0.0332303 -0.1019879 -0.0052384 0.002711 0.0425987 -0.003131 0.0865295 0.0847849 0.0007559 0.0647136 -0.0068956 0.0736335 0.0274918 0.0673399 -0.0572752 -0.1317907 0.0127065 0.0924412 -0.0736149 0.0716761 0.0689033 0.030309 -0.0773183 0.0536014 0.0429728 0.263648 -0.0523806 -0.009966 -0.1051411 0.1945965 0.006661 0.0973751 0.0337824 0.0165592 0.2307521 0.017518 0.089317 -0.0840602 0.0251678 -0.0962674 0.0886843 -0.0306949 0.2119787 0.2788375 -0.0706727 -0.0097568 -0.1356142 0.3461781 -0.0402504 0.0064137 0.005229 0.3020936 0.0294587 -0.005723 0.0622123 0.0090414 0.091957 -0.0505321 0.1165214 -0.0445634 -0.1105058 0.0260929 0.0295649 0.0184459 -0.0623497 -0.1575154 0.0248284 -0.0283089 -0.0191743 0.0909804 -0.1466101 0.0302303 -0.0463268 0.0398999 0.0354549 0.0840088 -0.1810421 0.0752511 -0.0335098 unknown
polarizability: 100.2045832|0.2436227|95.7962695|-0.5246467|-1.0555818|78.6593599 unknown
InChI: InChI=1S/C7H15NO3/c1-4-7(9)5(8)3-6(10-2)11-4/h4-7,9H,3,8H2,1-2H3
charge 0 multiplicity 1
26 atoms
O  -1.017947 -0.808485 -0.91907
O  2.345219 -1.053589 0.726291
O  -1.875443 0.8438 0.639869
N  2.350593 1.664289 0.130491
C  1.050894 0.950229 0.155727
C  1.323854 -0.535705 -0.179087
C  0.039394 -1.37093 -0.021844
C  -0.053742 1.491258 -0.782299
C  -1.309693 0.607254 -0.685365
C  0.212282 -2.832505 -0.422073
C  -3.165959 0.170763 0.843108
H  0.681367 0.99012 1.197572
H  1.668671 -0.60865 -1.238625
H  -0.300302 -1.286866 1.030898
H  -0.323494 2.529633 -0.518393
H  0.301813 1.478083 -1.831275
H  -2.056859 0.843912 -1.470407
H  -0.723561 -3.395136 -0.261164
H  0.485992 -2.910349 -1.489482
H  1.016267 -3.284463 0.182929
H  2.711098 1.833585 -0.816681
H  2.379454 2.514351 0.701808
H  2.956976 -0.270731 0.860448
H  -3.474502 0.414335 1.871443
H  -3.069021 -0.924105 0.722723
H  -3.924747 0.547402 0.126256
