program: Gaussian 09
title: 000099535
version: EM64L-G09RevD.01
frameworkgroup: C1[X(C19H22O5)]
method: RPBEPBE
basis: SDD
operation: Freq
keyword: #pfreq=noraman
keyword: PBEPBE/SDD
title: #p freq=noraman PBEPBE/SDD
converged: YES YES NO NO
title: Mulliken charges:
elementType: O O O O O C C C C C C C C C C C C C C C C C C C H H H H H H H H H H H H H H H H H H H H H H
charge: -0.279694 -0.208142 -0.239513 -0.180157 -0.221836 0.124760 -0.281575 -0.292760 0.151278 -0.162795 0.565422 0.118395 -0.100593 -0.536885 -0.778666 0.149379 -0.246277 -0.068424 -0.574041 -0.740948 -0.213303 0.190188 -0.715271 -0.722730 0.254198 0.301902 0.260132 0.232495 0.242819 0.223410 0.244068 0.232219 0.262760 0.240636 0.187289 0.272520 0.243393 0.237661 0.235555 0.216663 0.243582 0.202036 0.257676 0.248308 0.221328 0.203537
chargesum: 0.00000
title: Mulliken charges with hydrogens summed into heavy atoms:
elementType: O O O O O C C C C C C C C C C C C C C C C C C C
charge: -0.279694 -0.208142 -0.239513 -0.180157 -0.221836 0.124760 -0.027377 0.009142 0.151278 0.097337 0.565422 0.118395 0.131901 -0.070656 -0.039619 0.149379 -0.005641 0.118865 -0.301521 -0.024338 0.003360 0.190188 -0.011978 -0.049556
polarizability: 2.52928807e+02 1.55174209e+01 2.14332254e+02 -4.65214666e+00 7.51713791e-01 1.55800241e+02
1716.lowfreq: -9.5732 -0.0005 -0.0001 0.0008 3.4215 8.7973 35.3730 60.1878 64.1093
frequency: 35.2679 60.1854 64.0890 98.2857 110.3031 118.9982 152.5031 169.6212 185.4539 193.1518 201.8610 211.4345 220.6922 226.8795 235.1179 237.9692 249.9744 259.7598 272.2703 280.4291 303.3775 317.6102 343.3672 351.4535 370.8370 381.4615 419.5961 434.9137 448.9711 485.4887 495.1070 529.9327 548.4951 571.8801 608.3992 635.7606 652.4616 666.5673 679.4498 686.9478 694.0399 700.7695 729.5239 739.7376 787.7130 795.1136 815.1733 836.8283 858.4895 867.1593 885.2081 900.8762 908.0108 915.3664 923.4026 929.9653 943.2494 958.6732 962.4084 971.8415 981.6817 992.3695 996.3870 1012.9972 1031.1546 1046.1266 1055.5457 1098.6193 1104.6963 1120.5334 1133.4396 1141.1924 1152.2203 1169.0933 1172.7473 1188.2522 1194.7982 1216.6917 1238.6538 1244.4048 1259.0419 1271.5594 1279.3673 1289.1846 1295.0760 1314.4886 1327.0149 1331.5219 1338.9969 1350.0138 1361.4909 1369.1423 1377.8444 1390.2033 1397.0992 1398.2761 1405.7267 1456.1089 1464.6975 1468.5582 1474.2769 1478.7072 1479.0005 1483.0447 1485.5407 1500.6000 1622.2549 1657.4967 1666.1985 1705.8691 2950.8782 2961.3700 2970.1746 2979.8035 2986.1540 2994.2530 2996.7856 3002.7737 3021.5208 3043.3183 3072.4866 3083.6284 3087.1517 3088.2895 3093.7700 3097.2976 3105.0919 3113.6873 3113.7429 3114.4926 3142.5750 3170.5382
redmass: 4.3567 3.5232 4.5789 5.3207 5.0532 5.0792 4.0884 5.0057 2.6458 3.8470 1.1299 2.5951 1.3120 3.7104 2.0908 3.6719 2.0649 2.9572 1.1732 2.4007 3.0413 3.9111 5.0815 3.2906 3.4330 5.4839 3.4140 3.5820 5.5158 3.8370 3.7546 3.4326 6.0400 5.3687 4.5949 5.9260 4.9699 6.2920 4.5051 5.4255 5.2722 4.6637 2.4716 2.6344 4.9231 3.8909 5.0537 3.0199 3.0313 3.5685 4.6531 2.3570 2.0733 2.0257 1.4359 2.9588 2.2738 1.9773 1.6414 1.3048 1.9066 2.1503 2.2894 2.5679 1.9657 2.9238 1.6719 1.7215 1.8327 2.0705 3.0166 1.6329 1.8335 3.2680 2.2400 2.0522 1.8069 2.0660 1.5865 1.4940 1.6101 1.4954 1.5273 1.6090 1.4953 1.6141 1.5540 1.5431 1.5733 1.7097 2.3065 1.5793 1.1961 1.2573 1.2551 1.1974 2.7114 1.0844 1.0470 1.0519 1.0477 1.0611 1.0578 1.0480 1.0532 1.0536 11.5039 8.6576 7.1797 12.5098 1.0825 1.0630 1.0785 1.0398 1.0351 1.0363 1.0373 1.0837 1.0964 1.0856 1.0985 1.0999 1.0987 1.0994 1.0996 1.1011 1.0996 1.0916 1.0882 1.0946 1.0993 1.0920
irintensity: 2.9877 1.8346 2.8356 0.5709 0.6674 1.4813 1.6300 0.3129 0.8672 5.1067 1.0750 0.3497 1.0792 4.2118 0.7633 2.4390 4.0348 1.4853 1.1646 0.2325 0.5389 0.3318 1.1294 2.3034 2.7556 3.6806 2.1629 2.8867 4.5400 1.4246 1.9514 0.7795 2.5059 2.8828 2.0714 10.4940 9.6391 4.2912 43.3746 5.6429 1.9095 6.6169 18.7973 17.4664 2.7782 10.2872 10.7341 17.7234 28.3199 27.5504 13.9965 55.3196 38.1839 26.4109 3.3852 47.0193 15.9192 26.8017 7.1530 12.8985 12.4530 126.8091 69.3660 7.5703 15.7060 4.5404 1.3972 0.7407 4.3215 13.3615 3.4420 6.9099 13.0737 152.9619 14.4627 40.9684 5.1600 19.4652 2.4681 3.2268 0.0887 11.4586 0.6578 1.7979 7.7772 12.0071 5.1456 2.4101 0.1380 10.5598 1.0994 2.7104 22.5811 11.8161 24.7595 25.5219 0.8786 6.2056 5.0938 7.7553 5.0348 14.6720 7.7675 9.2000 7.5892 16.1675 114.8082 278.6274 13.2339 291.8103 16.4692 17.8134 34.3620 31.8016 17.2183 13.7100 32.0694 22.8189 15.4586 11.1118 39.4287 21.3379 15.7170 4.3790 41.5826 12.8783 14.2009 11.8221 4.4834 10.4304 32.1866 3.2033
temp: 298.150 k
press: 1.00000 atm
elementType: 8 8 8 8 8 6 6 6 6 6 6 6 6 6 6 6 6 6 6 6 6 6 6 6 1 1 1 1 1 1 1 1 1 1 1 1 1 1 1 1 1 1 1 1 1 1
symmnumber: 1
zpe: 973877.9 jmol-1
zpe.correction: 0.370930 hartree
zpe.thermalcorrener: 0.392756 hartree
zpe.thermalcorrenthalpy: 0.393700 hartree
zpe.thermalcorrgfe: 0.322456 hartree
zpe.sumelectzpe: -1111.496555 hartree
zpe.sumelectthermal: -1111.474729 hartree
zpe.sumelectthermalent: -1111.473785 hartree
zpe.sumelectthermalfe: -1111.545029 hartree
dipole: -2.9899 -0.4436 -0.2406
dipole: 3.0322
quadrupole: -162.5374 -148.3532 -144.6509
quadrupole: -28.0539 18.7359 8.7480
quadrupole: -10.6903 3.4940 7.1963 -28.0539 18.7359 8.7480
hfenergy: -1111.8674853 hartree
pointgroup: C01 [X(C19H22O5)]
dipole: 1.1812253 0.1459296 -0.0812258 debye
polarizability: 253.601277|14.4216358|213.5742563|5.7856599|0.2728694|155.8857683 unknown
InChI: InChI=1S/C19H22O5/c1-9(2)14-19-10(8-11(20)22-14)17(3)6-5-7-18(4)13(17)12(15(19)24-19)23-16(18)21/h5,7-9,12-15H,6H2,1-4H3
charge 0 multiplicity 1
46 atoms
O  -1.089703 1.036765 -1.571638
O  1.944335 2.0471 0.509109
O  -3.456336 -0.690352 -0.064762
O  4.042251 1.637233 1.433831
O  -3.616298 -2.920157 -0.568175
C  -1.230659 0.38295 -0.189255
C  -0.35565 1.591546 -0.374812
C  1.642959 -0.003674 -0.726747
C  0.909344 -1.000186 0.235632
C  1.136804 1.449312 -0.604287
C  -0.585138 -0.972797 -0.07207
C  3.154109 0.14533 -0.401972
C  -2.609454 0.43517 0.460539
C  1.57616 -2.38772 0.045196
C  1.008198 -0.602803 1.751833
C  3.160705 1.307852 0.630669
C  3.782711 -1.140976 0.101009
C  -3.468415 1.716006 0.330687
C  -1.403692 -2.063225 -0.113454
C  3.965219 0.643572 -1.643496
C  3.082138 -2.295925 0.237509
C  -2.875442 -1.95805 -0.27049
C  -4.038082 1.937087 -1.09146
C  -4.610029 1.668359 1.376604
H  -0.705726 2.573847 -0.03533
H  1.494026 -0.363558 -1.760079
H  1.378697 2.028074 -1.516739
H  -2.450102 0.225356 1.541566
H  1.338933 -2.793361 -0.960995
H  1.164792 -3.111231 0.775357
H  0.584826 0.393866 1.958262
H  0.452544 -1.345356 2.352076
H  2.054367 -0.604885 2.099613
H  4.861618 -1.110662 0.297182
H  -2.805927 2.568876 0.590053
H  -1.023237 -3.086499 -0.054211
H  5.010576 0.848306 -1.354188
H  3.963734 -0.136494 -2.424413
H  3.544697 1.570849 -2.072637
H  3.608395 -3.213466 0.530285
H  -4.72871 1.117812 -1.354365
H  -4.60157 2.887358 -1.121445
H  -3.240997 1.973156 -1.850516
H  -5.258271 0.793496 1.194011
H  -5.232637 2.578091 1.307379
H  -4.219766 1.60111 2.410031
