program: Gaussian 09
title: 000099463
version: EM64L-G09RevD.01
frameworkgroup: C1[X(C8H15NO3)]
method: RPBEPBE
basis: SDD
operation: Freq
keyword: #p
keyword: freq=noraman
keyword: PBEPBE/SDD
title: #p freq=noraman PBEPBE/SDD
converged: YES YES NO NO
title: Mulliken charges:
elementType: O O O N C C C C C C C C H H H H H H H H H H H H H H H
charge: -0.273578 -0.448529 -0.216006 -0.398798 -0.363130 -0.336412 -0.536855 -0.356105 0.253996 -0.693663 -0.386348 0.180494 0.237249 0.196673 0.183215 0.186592 0.230750 0.205297 0.195090 0.200374 0.217247 0.208121 0.210415 0.349525 0.278844 0.281743 0.393795
chargesum: 0.00000
title: Mulliken charges with hydrogens summed into heavy atoms:
elementType: O O O N C C C C C C C C
charge: -0.273578 -0.054734 -0.216006 -0.049272 0.070793 0.033395 -0.100808 0.039359 0.253996 -0.057880 0.174239 0.180494
polarizability: 1.40041489e+02 -1.29781462e+00 9.77258020e+01 -3.55780510e+00 -3.56943395e+00 7.48657950e+01
1716.lowfreq: -19.0658 -5.3210 0.0008 0.0010 0.0011 3.2211 8.3700 31.7692 35.8577
frequency: -3.8365 30.6586 35.5171 44.2625 77.6569 90.9656 121.2445 138.0147 176.4239 216.9148 227.2178 267.2518 286.4305 381.6570 419.1781 489.6653 511.6661 544.0859 581.2363 613.0024 652.5292 712.9657 725.5039 755.8110 818.0032 839.1311 891.0441 945.5603 953.5801 978.3159 1005.8773 1055.5851 1075.2513 1078.5823 1084.7730 1111.9432 1136.1775 1194.3046 1207.5814 1219.4419 1243.5597 1262.9339 1285.7585 1291.3004 1297.4417 1309.4049 1329.2969 1349.9611 1354.3386 1388.1273 1446.9470 1457.3867 1464.5300 1469.9796 1476.0949 1477.0143 1480.4782 1487.8758 1609.2134 1684.3043 2951.2710 2968.8735 2971.8936 2973.7574 2982.6720 2988.9904 2994.2702 3022.2960 3024.3121 3028.5027 3059.1818 3069.1209 3071.7679 3530.5153 3561.8262
redmass: 3.1379 2.6178 3.4063 6.9925 3.5524 2.4673 1.9673 3.7303 2.8714 4.2538 1.1237 6.6965 4.1940 3.4000 3.4740 1.8889 3.7394 4.1828 1.3412 2.4679 1.4421 4.2022 1.1051 1.2088 4.3477 1.3040 1.9925 3.5976 1.3315 2.0450 4.0239 3.2450 1.9240 2.2526 1.7286 2.2781 2.9521 1.6527 1.0928 1.5037 1.3293 1.2859 1.0520 1.1734 1.6400 1.7537 1.4841 1.5882 1.6598 1.2158 1.1010 1.1090 1.0677 1.0713 2.1080 1.0425 1.0718 1.0897 6.7705 9.1899 1.0588 1.0587 1.0377 1.0590 1.0653 1.0602 1.0946 1.0993 1.0990 1.1022 1.1031 1.1010 1.0992 1.0644 1.0784
irintensity: 0.3972 0.3522 7.4168 0.1265 0.5491 0.1430 0.5804 5.0640 2.8462 4.0207 0.0092 7.5250 2.2434 1.0607 8.4187 49.5990 18.2133 43.3745 37.5695 9.6929 193.5488 1.3813 13.2082 0.8637 17.0878 3.9574 9.0553 32.0659 2.0497 0.9529 1.0742 2.0067 38.7622 56.6333 151.7186 15.8400 1.1082 8.4275 0.7691 12.0589 18.5625 1.5890 0.7432 5.6484 17.8463 33.0319 8.6951 4.0680 4.8427 10.7265 8.2465 6.8780 0.7914 1.6592 402.3720 12.4806 4.8135 22.8603 150.7959 267.5357 14.9391 43.5267 34.1638 4.3957 60.3855 25.6982 11.2327 24.1873 5.2459 0.5109 30.8729 114.5337 52.8749 31.3675 58.6598
temp: 298.150 k
press: 1.00000 atm
elementType: 8 8 8 7 6 6 6 6 6 6 6 6 1 1 1 1 1 1 1 1 1 1 1 1 1 1 1
symmnumber: 1
zpe: 592511.6 jmol-1
zpe.correction: 0.225676 hartree
zpe.thermalcorrener: 0.239284 hartree
zpe.thermalcorrenthalpy: 0.240229 hartree
zpe.thermalcorrgfe: 0.183086 hartree
zpe.sumelectzpe: -593.330793 hartree
zpe.sumelectthermal: -593.317184 hartree
zpe.sumelectthermalent: -593.316240 hartree
zpe.sumelectthermalfe: -593.373383 hartree
dipole: -0.4727 -4.3668 0.6837
dipole: 4.4452
quadrupole: -78.5134 -75.2594 -72.1926
quadrupole: -9.1083 2.4720 0.2361
quadrupole: -3.1916 0.0624 3.1292 -9.1083 2.4720 0.2361
hfenergy: -593.5564688 hartree
pointgroup: C01 [X(C8H15N1O3)]
dipole: -0.2701866 0.8720369 1.4916969 debye
polarizability: 139.3508736|-4.613095|80.3407208|5.8152849|9.9847387|92.9414921 unknown
InChI: InChI=1S/C8H15NO3/c1-2-3-4-5-7(10)9-6-8(11)12/h9,11H,2-6H2,1H3
charge 0 multiplicity 1
27 atoms
O  0.441041 -0.622762 -1.736475
O  3.461327 0.559886 1.871736
O  5.080284 -0.538764 0.613813
N  1.505542 0.183808 0.15187
C  -2.11406 -0.269859 -0.208781
C  -3.448144 0.440748 0.107094
C  -0.8987 0.685773 -0.133939
C  -4.663853 -0.513173 0.057517
C  0.383964 0.025409 -0.644785
C  -6.000667 0.199967 0.354711
C  2.787847 -0.38655 -0.258744
C  3.901758 -0.155058 0.743534
H  -2.145662 -0.70819 -1.2240
H  -1.964969 -1.113024 0.495534
H  -3.395441 0.911928 1.111492
H  -3.603656 1.267742 -0.617353
H  -1.098189 1.563307 -0.781695
H  -0.768194 1.068221 0.897512
H  -4.511224 -1.336009 0.785363
H  -4.710746 -0.988667 -0.943111
H  -6.852663 -0.503142 0.311431
H  -5.991518 0.658176 1.361923
H  -6.190588 1.00638 -0.378575
H  1.467964 0.689409 1.038432
H  3.113166 0.026473 -1.23413
H  2.697113 -1.477798 -0.427833
H  4.218567 0.690268 2.503262
