program: Gaussian 09
title: 000099451
version: EM64L-G09RevD.01
frameworkgroup: C1[X(C6H4S4)]
method: RPBEPBE
basis: SDD
operation: Freq
keyword: #p
keyword: freq=noraman
keyword: PBEPBE/SDD
title: #p freq=noraman PBEPBE/SDD
converged: NO NO NO NO
title: Mulliken charges:
elementType: S S S S C C C C C C H H H H
charge: 0.274543 0.274529 0.274544 0.274532 -0.333494 -0.333494 -0.367778 -0.367775 -0.367777 -0.367778 0.259987 0.259987 0.259987 0.259987
chargesum: 0.00000
title: Mulliken charges with hydrogens summed into heavy atoms:
elementType: S S S S C C C C C C
charge: 0.274543 0.274529 0.274544 0.274532 -0.333494 -0.333494 -0.107791 -0.107788 -0.107790 -0.107791
polarizability: 1.96303895e+02 1.64466292e-04 1.34483844e+02 7.85707046e-05 -2.18566877e-07 4.24094440e+01
1716.lowfreq: -0.0023 0.0019 0.0026 7.8890 10.0622 10.0936 10.6567 75.7279 79.4838
frequency: 10.0622 75.6781 79.4838 101.4980 235.2547 242.7916 293.9878 395.6025 398.5266 420.5789 443.3350 471.3147 582.0152 591.7220 645.8507 647.2022 677.0438 679.9829 714.6805 756.6975 761.4263 777.0793 832.7000 833.2392 905.2081 1102.9421 1103.1455 1235.5686 1236.9318 1557.7405 1561.0318 1607.3026 3195.5227 3195.7341 3223.3643 3223.4340
redmass: 5.0100 7.3891 20.3671 9.9522 15.1683 13.2347 18.4397 4.1907 4.2539 23.6560 25.8529 11.8349 9.5524 9.5406 1.1902 1.1815 9.9546 9.3540 11.8698 4.2803 4.2973 11.5960 1.2234 1.2208 9.9217 1.0351 1.0356 1.2787 1.2940 8.3310 7.7191 10.6165 1.0854 1.0856 1.1041 1.1042
irintensity: 4.0685 0.0001 0.0000 0.7477 0.0004 5.4323 0.0000 0.0000 0.0000 15.6121 0.0000 0.0001 0.0000 3.4182 0.0001 225.9353 23.2351 0.0000 28.0777 53.1560 0.0000 2.4451 0.0000 0.0000 0.0000 11.4536 0.0001 1.4106 0.0000 0.0000 53.6771 0.0000 0.0001 7.4659 0.4645 0.0000
temp: 298.150 k
press: 1.00000 atm
elementType: 16 16 16 16 6 6 6 6 6 6 1 1 1 1
symmnumber: 1
zpe: 208244.0 jmol-1
zpe.correction: 0.079316 hartree
zpe.thermalcorrener: 0.089726 hartree
zpe.thermalcorrenthalpy: 0.090670 hartree
zpe.thermalcorrgfe: 0.040292 hartree
zpe.sumelectzpe: -1822.488703 hartree
zpe.sumelectthermal: -1822.478293 hartree
zpe.sumelectthermalent: -1822.477349 hartree
zpe.sumelectthermalfe: -1822.527727 hartree
dipole: 0.0000 0.0000 0.0036
dipole: 0.0036
quadrupole: -61.2877 -86.2643 -94.2768
quadrupole: -0.0002 0.0000 0.0000
quadrupole: 19.3219 -5.6547 -13.6672 -0.0002 0.0000 0.0000
hfenergy: -1822.5680191 hartree
pointgroup: C01 [X(C6H4S4)]
dipole: -0.0000014 -0.0000049 -0.0013986 debye
dipolederiv: -0.4074005 0.1608108 -0.0002756 -0.3555145 -0.1386662 -0.0000917 0.0002798 0.0001296 0.0974656 -0.4073717 -0.1607808 -0.0002759 0.3555356 -0.1386929 0.0001039 0.0002694 -0.0001376 0.0974619 -0.4074093 0.1608113 0.0002744 -0.3555168 -0.1386655 0.0000915 -0.0002944 -0.0001314 0.0974666 -0.4073594 -0.1607822 0.0002747 0.3555382 -0.1386932 -0.0001037 -0.0002841 0.0001395 0.097463 0.3900945 -0.0000195 -0.0001598 -0.0000086 0.120086 -0.0000112 0.0001651 -0.0000037 -0.184767 0.3900988 -0.0000149 0.0001664 0.0000006 0.1200848 0.0000112 -0.0001404 0.0000037 -0.1847666 0.2101575 -0.3526905 0.000508 -0.3984589 0.0094876 -0.0003304 0.0001833 -0.0002878 -0.2382093 0.2102133 0.3526726 0.000502 0.3984435 0.0094195 0.0003181 0.0001559 0.0002939 -0.2382105 0.2101587 -0.352692 -0.000511 -0.3984642 0.0094886 0.0003297 -0.0001816 0.0002885 -0.2382109 0.2102087 0.3526729 -0.000505 0.3984376 0.0094175 -0.0003174 -0.0001542 -0.0002946 -0.2382114 0.0021502 -0.0217616 -0.0001912 -0.0399353 0.0691852 -0.000032 -0.0002143 -0.0000017 0.2331292 0.0021547 0.021767 -0.0001929 0.0399372 0.0691814 0.0000402 -0.0002186 0.0000041 0.2331298 0.0021495 -0.0217614 0.0001922 -0.0399327 0.069186 0.0000323 0.0002149 0.0000029 0.2331302 0.002155 0.0217684 0.0001939 0.0399382 0.0691812 -0.0000405 0.0002192 -0.0000052 0.2331295 unknown
polarizability: 196.3038953|-0.0033458|134.4838446|0.0000786|0.0000002|42.409444 unknown
InChI: InChI=1S/C6H4S4/c1-2-8-5(7-1)6-9-3-4-10-6/h1-4H
charge 0 multiplicity 1
14 atoms
S  -1.682831 -1.546521 0.000519
S  -1.682695 1.546687 0.000476
S  1.682826 1.546511 0.000532
S  1.682673 -1.546695 0.000489
C  -0.679932 0.000029 0.000508
C  0.679918 -0.000025 0.000505
C  -3.275304 -0.678179 -0.001152
C  -3.275248 0.67848 -0.001206
C  3.275294 0.678159 -0.001147
C  3.275225 -0.678501 -0.001201
H  -4.169234 -1.303401 -0.001961
H  -4.169125 1.303777 -0.002051
H  4.169229 1.303373 -0.001961
H  4.169105 -1.303795 -0.002051
