program: Gaussian 09
title: 000099448
version: EM64L-G09RevD.01
frameworkgroup: C1[X(C11H18N2S)]
method: RPBEPBE
basis: SDD
operation: Freq
keyword: #p
keyword: freq=noraman
keyword: PBEPBE/SDD
title: #p freq=noraman PBEPBE/SDD
converged: YES YES NO NO
title: Mulliken charges:
elementType: S N N C C C C C C C C C C C H H H H H H H H H H H H H H H H H H
charge: 0.183072 0.041695 -0.020514 -0.360899 -0.347581 -0.349439 -0.354913 -0.654505 -0.694248 -0.332304 0.239757 -0.763280 -0.279018 -0.295233 0.192204 0.192174 0.188673 0.188658 0.210737 0.211078 0.195296 0.195375 0.278944 0.277756 0.210254 0.210254 0.216724 0.241725 0.253964 0.241657 0.240301 0.241635
chargesum: 0.00000
title: Mulliken charges with hydrogens summed into heavy atoms:
elementType: S N N C C C C C C C C C C C
charge: 0.183072 0.041695 -0.020514 0.023479 0.029750 0.072376 0.035757 -0.097805 -0.057016 -0.332304 0.239757 -0.025933 -0.038717 -0.053597
polarizability: 2.21331823e+02 -1.27097256e+01 1.55022453e+02 -5.82179456e-01 -1.31597323e-02 9.01825936e+01
1716.lowfreq: -13.4387 -0.0011 0.0012 0.0022 2.6538 8.3409 16.3958 33.4718 44.1722
frequency: 15.0394 33.3369 44.1513 59.5901 86.5035 108.9867 114.5811 119.5956 127.8499 138.1151 169.7702 223.4359 229.1581 256.5199 288.9148 379.3279 408.3366 447.0387 447.7488 455.1258 507.7731 558.2760 654.6784 697.9294 724.8793 737.3996 754.4732 782.4166 835.6188 846.0996 869.2389 890.5447 939.8225 953.6020 973.3697 1006.4166 1030.7372 1041.7124 1042.3975 1063.9129 1066.3795 1071.3378 1079.7725 1116.3151 1182.9751 1189.5100 1223.1232 1235.5104 1246.0557 1263.8971 1265.8704 1278.8078 1289.4441 1297.1198 1315.3034 1348.8878 1355.2642 1355.9554 1389.4365 1390.1468 1413.4179 1440.7929 1451.8866 1457.2173 1464.1504 1465.8629 1473.5831 1476.9359 1481.7715 1488.3601 1500.8203 1508.1618 2955.2100 2960.3890 2969.1503 2972.3614 2978.4475 2979.7010 2992.1292 3007.9562 3027.7180 3038.1854 3045.4142 3052.9904 3068.9926 3071.9394 3114.6649 3119.7302 3137.2727 3165.3856
redmass: 3.2058 2.0333 4.3595 3.5582 1.8006 2.5429 3.9882 1.3584 2.3672 1.9233 4.2691 3.7686 1.1192 3.7293 3.7248 4.4046 3.5452 3.6284 5.1172 8.6567 3.1714 6.6304 7.8492 6.2908 1.0640 1.0913 4.6881 1.1669 6.6386 1.2290 1.2183 1.8899 1.4570 1.9133 1.1876 3.8749 3.6597 3.2356 1.5612 3.0960 2.9225 1.1147 2.2577 2.4481 2.5702 1.6886 1.2758 1.3463 2.9528 1.7007 2.0802 1.1512 1.0685 1.0973 1.3462 1.5399 1.7267 2.2123 1.2160 1.2336 1.9713 1.0882 1.2467 1.0448 1.0672 1.0771 1.0720 1.0424 1.0808 1.0888 5.9437 3.7849 1.0589 1.0590 1.0588 1.0367 1.0383 1.0589 1.0981 1.1014 1.1039 1.0572 1.1046 1.0964 1.1008 1.0993 1.1083 1.0983 1.0878 1.0991
irintensity: 0.0047 0.0568 0.0088 0.4284 0.5673 0.8601 0.5045 0.1913 1.2304 0.3673 0.3837 1.3956 0.0049 6.7790 0.0159 0.7579 1.8130 6.8453 6.3521 5.9113 0.1119 4.6378 7.1015 7.1468 13.7041 0.6203 0.3460 3.1864 14.2625 31.0283 0.3555 2.8963 0.0193 8.7316 0.9468 0.1590 19.6688 45.2604 8.0677 28.2806 12.4849 0.3291 1.4239 20.0808 37.0986 0.4509 1.1143 0.0954 2.3060 2.1293 16.1763 0.0173 0.2580 0.4367 14.6491 19.8773 22.5303 65.4023 10.5757 23.1497 31.3569 8.6351 7.5075 18.3207 0.7944 0.1876 1.6241 12.6358 2.8750 21.7006 19.6159 59.1142 1.4401 4.5875 70.1445 36.0798 9.6824 55.0632 0.0249 0.0104 9.9629 11.6066 76.6304 13.6136 94.8264 53.2286 19.7441 11.5403 2.6615 46.1042
temp: 298.150 k
press: 1.00000 atm
elementType: 16 7 7 6 6 6 6 6 6 6 6 6 6 6 1 1 1 1 1 1 1 1 1 1 1 1 1 1 1 1 1 1
symmnumber: 1
zpe: 707627.8 jmol-1
zpe.correction: 0.269521 hartree
zpe.thermalcorrener: 0.285949 hartree
zpe.thermalcorrenthalpy: 0.286893 hartree
zpe.thermalcorrgfe: 0.222522 hartree
zpe.sumelectzpe: -936.434771 hartree
zpe.sumelectthermal: -936.418343 hartree
zpe.sumelectthermalent: -936.417399 hartree
zpe.sumelectthermalfe: -936.481769 hartree
dipole: 1.7746 0.7364 -0.0016
dipole: 1.9213
quadrupole: -96.7692 -88.7382 -94.1979
quadrupole: -2.9150 -0.0173 0.0399
quadrupole: -3.5341 4.4969 -0.9628 -2.9150 -0.0173 0.0399
hfenergy: -936.7042917 hartree
pointgroup: C01 [X(C11H18N2S1)]
dipole: -0.6934048 0.3004812 0.0167046 debye
polarizability: 221.725451|11.5790349|154.2967027|1.2001765|4.6259357|90.5147159 unknown
InChI: InChI=1S/C11H18N2S/c1-3-4-5-6-9-14-11-10(2)12-7-8-13-11/h7-8H,3-6,9H2,1-2H3
charge 0 multiplicity 1
32 atoms
S  0.676887 -1.24491 0.012643
N  1.995199 1.166036 0.184607
N  4.572863 -0.020069 0.091812
C  -3.235623 0.360508 0.098229
C  -4.62023 -0.32085 0.011453
C  -2.065195 -0.650098 0.022953
C  -5.79593 0.679965 0.087311
C  -0.704237 0.058224 0.105742
C  -7.176156 -0.005984 -0.002435
C  2.155033 -0.179007 0.086822
C  3.453416 -0.796781 0.039511
C  3.626119 -2.290348 -0.067436
C  3.130489 1.925513 0.235852
C  4.41013 1.337788 0.189689
H  -3.167727 0.934265 1.045677
H  -3.138832 1.099991 -0.723522
H  -4.717928 -1.06251 0.831538
H  -4.689603 -0.894048 -0.936596
H  -2.160378 -1.3832 0.848625
H  -2.134685 -1.222602 -0.923305
H  -5.696296 1.421588 -0.73151
H  -5.726815 1.252345 1.034892
H  -0.542128 0.761082 -0.727057
H  -0.570599 0.606311 1.052075
H  -7.313254 -0.730872 0.822114
H  -7.283232 -0.558564 -0.954982
H  -7.998835 0.730207 0.055026
H  3.152082 -2.682233 -0.987569
H  4.699509 -2.532707 -0.081529
H  3.146337 -2.811077 0.783142
H  2.994011 3.008937 0.313594
H  5.322209 1.940898 0.229336
