program: Gaussian 09
title: 000010829
version: EM64L-G09RevD.01
frameworkgroup: C1[X(C17H16O7)]
method: RPBEPBE
basis: SDD
operation: Freq
keyword: #pfreq=noraman
keyword: PBEPBE/SDD
title: #p freq=noraman PBEPBE/SDD
converged: YES YES NO NO
title: Mulliken charges:
elementType: O O O O O O O C C C C C C C C C C C C C C C C C H H H H H H H H H H H H H H H H
charge: -0.314810 -0.255394 -0.408288 -0.401255 -0.334442 -0.418912 -0.349592 -0.057089 0.471984 0.473543 0.495825 -0.038172 0.176237 -0.561045 -0.602455 0.388598 0.183684 0.198334 -0.582478 -0.532655 -0.790430 -0.786723 0.170456 -0.534396 0.280505 0.260541 0.285623 0.274180 0.240995 0.239800 0.226436 0.242869 0.245938 0.228595 0.391812 0.391554 0.248996 0.230515 0.229842 0.391275
chargesum: 0.00000
title: Mulliken charges with hydrogens summed into heavy atoms:
elementType: O O O O O O O C C C C C C C C C C C C C C C C C
charge: -0.314810 -0.255394 -0.016476 -0.009701 -0.334442 -0.027638 -0.349592 -0.057089 0.471984 0.473543 0.495825 -0.038172 0.176237 -0.280540 -0.341913 0.388598 0.183684 0.198334 -0.296855 -0.258476 -0.083200 -0.069321 0.170456 0.174958
polarizability: 4.15315365e+02 2.27437599e+00 2.09340181e+02 -3.16835425e+00 2.20440281e+00 1.13553917e+02
1716.lowfreq: -2.3000 -0.0005 0.0004 0.0006 2.7288 8.3826 13.0002 18.9613 34.2635
frequency: 12.9644 18.9341 34.2579 64.7205 69.3740 94.2100 108.6271 117.5864 142.8623 175.8423 191.4044 195.6370 210.0236 213.2479 223.9710 228.9551 243.1933 246.6295 278.1804 298.6519 322.7508 329.8815 343.7020 363.4078 382.8996 393.4254 428.0235 441.5442 515.3382 523.4710 540.7897 542.0623 552.6194 555.0794 573.4858 586.9361 593.1275 605.4024 619.6721 620.7528 658.1358 670.6508 684.2191 715.8099 748.4366 759.7393 785.6613 842.7546 856.9276 868.0620 873.5429 890.4667 892.7949 913.1473 945.4629 984.0741 986.1227 1006.2807 1023.1246 1046.2671 1046.7287 1051.5281 1062.0901 1064.8423 1111.1611 1122.7863 1144.2420 1158.0403 1168.9689 1221.8497 1229.3536 1244.2809 1283.0396 1307.4215 1319.6276 1346.8992 1370.7700 1395.1956 1399.9072 1403.3106 1404.8336 1427.8537 1435.6157 1437.4494 1450.7849 1455.3313 1461.6712 1462.1531 1466.7645 1470.8676 1477.6396 1483.3338 1567.4977 1571.8128 1574.5181 1586.4419 1639.7222 1647.4037 2905.6583 2920.8603 2972.8078 2996.7821 2998.1193 3066.3523 3082.5864 3082.6684 3097.3041 3101.0278 3134.9102 3167.0509 3188.5742 3195.2910 3199.6474 3502.9507
redmass: 5.3788 5.8026 5.8182 5.7823 5.3211 4.3851 10.3486 5.5791 6.4209 3.8787 1.9881 1.7769 1.9115 1.9100 2.3820 2.3697 2.9519 1.7761 5.1894 4.8951 4.9746 3.2989 4.2309 7.3762 7.0829 7.7123 6.1618 7.7159 5.8897 7.2678 5.2977 3.2319 3.2944 5.4395 5.4394 5.1703 1.6440 3.8508 3.2866 7.1226 5.1428 3.3168 3.0799 4.6010 3.6505 4.7539 6.7947 1.5908 1.3881 1.5912 1.6548 1.0739 1.1146 7.2491 6.4896 2.3003 2.6630 4.8836 4.4966 1.5620 1.5655 4.7665 2.0092 2.1839 1.2602 2.3526 1.5515 1.6374 1.9664 1.6323 1.4172 2.2191 2.2794 6.2787 7.0091 3.8799 4.8109 3.0197 2.7255 1.2469 1.3163 1.8619 2.4940 2.2824 2.3490 2.8471 1.0460 1.0561 1.0497 1.0604 1.2560 1.3443 3.4600 5.7012 4.5842 5.9402 4.3629 4.6740 1.0703 1.0698 1.0322 1.0364 1.0364 1.1045 1.0966 1.0964 1.1010 1.1012 1.1007 1.0920 1.0920 1.0933 1.0928 1.0635
irintensity: 0.8464 0.6691 0.5497 1.4900 0.1273 3.6968 0.9183 4.0262 0.8539 3.3657 0.5093 3.6711 0.5795 0.6818 1.0767 0.3427 0.9827 0.0999 0.7999 4.3910 2.4263 0.4635 1.4142 7.8345 7.3544 10.4675 7.2201 23.0018 8.0320 9.9928 0.8321 16.3308 0.0629 50.2421 11.7114 4.3335 67.6894 4.5410 11.0073 4.0328 61.4239 14.2914 57.2146 6.1572 4.5686 0.1750 7.0783 29.4516 5.0251 45.8675 111.4553 114.3613 78.7354 47.3946 11.4393 38.8268 16.7180 370.0381 113.2356 8.8230 10.7073 60.5804 80.4038 137.1950 0.1100 797.7842 152.8964 172.5181 193.9523 285.1700 48.7869 371.8751 91.4818 450.0784 192.3960 174.1514 3.0722 127.8236 119.2496 44.7958 49.5412 70.1652 207.0379 13.3902 13.3149 98.6755 15.2287 12.5842 15.1972 67.6014 66.8068 33.4511 88.2679 66.0827 84.5824 255.0893 1033.7176 32.4196 424.5806 331.1416 66.1886 16.7236 14.6642 37.8781 9.1392 12.6983 31.1681 19.7824 22.0661 3.6404 2.9712 0.4449 0.3436 81.1647
temp: 298.150 k
press: 1.00000 atm
elementType: 8 8 8 8 8 8 8 6 6 6 6 6 6 6 6 6 6 6 6 6 6 6 6 6 1 1 1 1 1 1 1 1 1 1 1 1 1 1 1 1
symmnumber: 1
zpe: 784999.4 jmol-1
zpe.correction: 0.298990 hartree
zpe.thermalcorrener: 0.321310 hartree
zpe.thermalcorrenthalpy: 0.322254 hartree
zpe.thermalcorrgfe: 0.246057 hartree
zpe.sumelectzpe: -1182.266602 hartree
zpe.sumelectthermal: -1182.244283 hartree
zpe.sumelectthermalent: -1182.243338 hartree
zpe.sumelectthermalfe: -1182.319536 hartree
dipole: -1.5201 1.3003 1.8373
dipole: 2.7161
quadrupole: -100.2100 -144.2576 -142.2844
quadrupole: 11.7924 6.3715 1.2196
quadrupole: 28.7073 -15.3403 -13.3670 11.7924 6.3715 1.2196
hfenergy: -1182.5655923 hartree
pointgroup: C01 [X(C17H16O7)]
dipole: 0.6025952 -0.6991678 -0.5384596 debye
polarizability: 414.5521641|11.1686744|113.9775618|-9.2501012|2.6660887|209.6797376 unknown
InChI: InChI=1S/C17H16O7/c1-8-5-11(7-12(18)14(8)16(20)21)24-17(22)15-9(2)4-10(23-3)6-13(15)19/h4-7,18-20H,1-3H3
charge 0 multiplicity 1
40 atoms
O  0.017675 -0.112156 0.612031
O  6.50056 -0.142625 0.52218
O  2.796716 0.899067 -2.4118
O  -4.193239 0.591472 2.677239
O  0.444464 0.570198 -1.575467
O  -6.379192 -0.879754 -0.626221
O  -6.342677 -0.01344 1.497648
C  2.318382 0.071001 -0.12359
C  2.876369 -0.389799 1.131432
C  -3.436239 -0.770805 -0.756567
C  -1.397189 -0.150348 0.451276
C  -4.215134 -0.34784 0.38087
C  3.233065 0.458335 -1.183268
C  -2.032765 -0.668669 -0.704542
C  4.269301 -0.437624 1.276011
C  5.144412 -0.043119 0.223989
C  -3.529242 0.16996 1.549758
C  0.897019 0.19027 -0.439582
C  -2.120497 0.263484 1.574585
C  4.633074 0.403585 -1.006808
C  2.037354 -0.837238 2.316312
C  -4.049536 -1.329139 -2.028379
C  -5.675672 -0.394566 0.468574
C  7.462523 0.250317 -0.517035
H  -1.437607 -0.970069 -1.5668
H  4.718314 -0.783285 2.211163
H  -1.622021 0.653948 2.463563
H  5.261388 0.71273 -1.84429
H  1.401216 -0.019277 2.695959
H  1.352457 -1.659284 2.046921
H  2.693271 -1.179538 3.133866
H  -4.653604 -2.230885 -1.829337
H  -4.733651 -0.603324 -2.500744
H  -3.256449 -1.585058 -2.749787
H  1.769143 0.886471 -2.407353
H  -5.200652 0.469971 2.519548
H  8.451534 0.093887 -0.063487
H  7.33673 1.314598 -0.791201
H  7.3551 -0.38421 -1.416762
H  -7.349901 -0.842139 -0.404103
