program: Gaussian 09
title: 000099472
version: EM64L-G09RevD.01
frameworkgroup: C1[X(C20H28O3)]
method: RPBEPBE
basis: SDD
operation: Freq
keyword: #pfreq=noraman
keyword: PBEPBE/SDD
title: #p freq=noraman PBEPBE/SDD
converged: YES YES NO NO
title: Mulliken charges:
elementType: O O O C C C C C C C C C C C C C C C C C C C C H H H H H H H H H H H H H H H H H H H H H H H H H H H H
charge: -0.420302 -0.233752 -0.236039 -0.098233 0.375226 -0.155335 -0.099068 0.231600 -0.525788 -0.221906 -0.528719 -0.563347 -0.482562 -0.478909 0.541484 -0.829287 -0.641292 -0.492764 -0.810600 0.098201 -0.563366 -0.586770 0.177921 0.212716 0.229663 0.201202 0.201304 0.230463 0.270406 0.219602 0.226567 0.214098 0.235881 0.227202 0.217699 0.258929 0.215342 0.246029 0.227576 0.226279 0.222390 0.235762 0.218359 0.215420 0.220730 0.227878 0.234850 0.245280 0.231513 0.255384 0.375082
chargesum: 0.00000
title: Mulliken charges with hydrogens summed into heavy atoms:
elementType: O O O C C C C C C C C C C C C C C C C C C C C
charge: -0.045220 -0.233752 -0.236039 0.114483 0.375226 0.074329 0.102134 0.231600 -0.094022 0.048500 -0.082549 -0.113368 -0.037661 -0.004639 0.541484 -0.129402 -0.183140 -0.058984 -0.127142 0.098201 -0.086574 -0.331386 0.177921
polarizability: 2.87516077e+02 -4.54568872e+00 2.00376984e+02 -1.58450347e+01 1.55765473e+00 1.63734239e+02
1716.lowfreq: -15.8237 -8.2488 -0.0007 -0.0007 -0.0003 8.5545 32.1710 36.3901 49.5041
frequency: 31.9563 36.3091 49.4552 62.3629 87.7054 106.5792 145.5009 157.8107 174.3658 193.1902 203.3230 205.5774 229.2474 235.7844 251.6828 261.6694 271.9081 282.2453 301.4031 315.9746 345.1929 364.8875 380.9713 400.6606 414.6696 426.4792 448.4457 459.2823 496.7650 498.7290 527.3237 528.6880 557.4311 569.2393 598.4831 619.5645 633.2675 645.9270 673.2335 693.2350 735.4324 744.0579 775.5429 804.8161 817.9160 829.6060 838.8779 857.0397 881.7553 898.7693 912.8937 924.6776 936.8052 940.9305 951.9946 957.8617 971.0956 993.1932 1006.0058 1022.1654 1026.1417 1027.1940 1031.9578 1047.2786 1066.5474 1074.3279 1081.7913 1097.8987 1113.1237 1116.1252 1124.4082 1128.3943 1135.0991 1157.5500 1177.2611 1184.8224 1188.8139 1200.4275 1205.4289 1213.2341 1230.0807 1236.9001 1240.0780 1246.8491 1253.4776 1271.5989 1279.2398 1279.8769 1287.2205 1296.9270 1302.8411 1318.8432 1322.6773 1326.3469 1333.0453 1335.9150 1342.2096 1345.9630 1351.1903 1353.7379 1356.8244 1373.9215 1387.0650 1397.7376 1446.4523 1453.1610 1458.8177 1464.7434 1467.4668 1468.9681 1472.1623 1479.9395 1482.1388 1486.7012 1492.1115 1496.7481 1584.8078 1623.9996 1656.3469 2909.7180 2917.8965 2953.3244 2961.0577 2966.4321 2971.6643 2973.3787 2979.0054 2986.2549 2989.1241 2992.2179 2993.9220 3010.9440 3019.2751 3033.2928 3035.3814 3039.4326 3041.0968 3048.8982 3053.4794 3062.1269 3075.5799 3078.4636 3081.9990 3083.0279 3093.3743 3117.5155 3502.2763
redmass: 6.8314 6.2156 4.0417 5.4213 4.3783 2.9935 2.2443 4.7330 2.1737 1.9596 2.8617 2.5043 1.5108 1.9233 1.8924 2.6993 2.6216 2.3328 3.2823 2.8479 3.0313 2.9775 2.9550 3.3781 3.1666 3.6775 3.3111 3.1223 3.4480 2.5735 2.9814 2.4480 2.5963 2.8689 3.9646 1.8457 2.1390 3.6784 3.1836 2.7590 2.9148 2.7297 2.1319 2.1782 2.1875 1.9854 2.0256 2.1940 1.5037 1.7565 1.9515 1.8083 2.0666 3.4617 2.0359 2.0244 2.2724 2.1375 2.0103 2.3333 2.3713 2.0373 1.8607 1.9920 2.3033 2.2259 2.6152 1.7743 1.9374 2.3759 1.7672 1.9848 1.6744 2.5043 1.3930 1.8091 1.8739 2.2708 1.5207 1.2269 1.3925 1.6641 1.5656 1.3551 1.3812 1.5878 1.9248 1.4439 1.3996 1.4202 1.3812 1.5228 1.4192 1.4108 1.3522 1.4105 2.0958 1.5266 1.5171 1.3936 1.6144 1.4868 1.2168 1.2043 1.0776 1.0876 1.0749 1.0852 1.0888 1.0857 1.0737 1.0724 1.0552 1.0580 1.0830 1.0589 10.0439 7.7374 8.1573 1.0815 1.0804 1.0657 1.0763 1.0631 1.0668 1.0653 1.0633 1.0382 1.0426 1.0607 1.0552 1.0793 1.0676 1.0970 1.0951 1.0995 1.0991 1.1010 1.0998 1.0955 1.0973 1.0989 1.1031 1.0987 1.0986 1.0911 1.0638
irintensity: 3.3845 1.3541 0.7921 0.5492 0.1972 0.8013 0.3538 1.4297 1.1932 0.6617 0.6327 0.0332 0.0854 0.3386 0.8690 0.7787 0.2460 0.2430 2.5513 2.5007 1.3583 1.7567 5.5285 4.4889 4.2328 1.5557 6.8746 2.7568 2.8389 7.3115 0.8184 1.3163 3.2040 17.3663 25.5049 44.3123 56.3565 4.2410 0.5457 27.1571 1.7646 14.4963 6.1409 0.0644 2.0523 2.6458 0.7228 8.3328 13.9878 7.0729 7.4221 3.2532 13.6662 28.4538 16.5236 7.2506 4.4950 0.9285 4.9597 62.3454 25.5391 8.5871 5.8179 33.1350 56.4375 28.2802 23.3717 22.3865 12.2137 6.0244 2.9512 1.2658 5.2451 0.8726 2.6437 4.6999 25.5312 6.8467 13.8437 12.0331 20.5752 4.0875 12.3623 12.3842 4.4791 6.6997 35.2834 1.9949 7.1962 8.0620 1.4743 3.2791 8.6933 1.9459 1.0380 0.7210 11.8537 1.6865 6.0610 3.5623 21.1077 18.2204 13.5657 29.3452 17.0299 21.1520 1.8800 9.4229 9.2962 9.0500 7.4924 3.4413 7.3152 6.1270 9.5071 7.7460 163.0656 209.4860 221.4366 7.2979 17.9436 15.6743 7.7079 27.8114 33.6635 34.7178 26.8339 19.6419 5.4229 30.6168 35.1999 16.4240 25.9940 19.5126 40.4076 5.9815 89.2259 34.5307 25.5400 22.1620 28.1702 36.7786 37.6561 26.3063 26.2879 10.9244 20.6869
temp: 298.150 k
press: 1.00000 atm
elementType: 8 8 8 6 6 6 6 6 6 6 6 6 6 6 6 6 6 6 6 6 6 6 6 1 1 1 1 1 1 1 1 1 1 1 1 1 1 1 1 1 1 1 1 1 1 1 1 1 1 1 1
symmnumber: 1
zpe: 1154761.7 jmol-1
zpe.correction: 0.439826 hartree
zpe.thermalcorrener: 0.461266 hartree
zpe.thermalcorrenthalpy: 0.462210 hartree
zpe.thermalcorrgfe: 0.390534 hartree
zpe.sumelectzpe: -1002.852842 hartree
zpe.sumelectthermal: -1002.831402 hartree
zpe.sumelectthermalent: -1002.830458 hartree
zpe.sumelectthermalfe: -1002.902134 hartree
dipole: -3.4222 -0.2566 1.1165
dipole: 3.6089
quadrupole: -192.9686 -129.0676 -139.5810
quadrupole: 5.7937 16.8640 -1.8011
quadrupole: -39.0962 24.8048 14.2914 5.7937 16.8640 -1.8011
hfenergy: -1003.292668 hartree
pointgroup: C01 [X(C20H28O3)]
dipole: 1.3459549 -0.1182341 -0.4362885 debye
polarizability: 287.5612485|3.7373296|200.2393335|-15.9343166|-2.3921495|163.8267179 unknown
InChI: InChI=1S/C20H28O3/c1-19-9-7-13(21)11-12(19)3-4-14-15-5-6-17(18(22)23)20(15,2)10-8-16(14)19/h11,14-17,22H,3-10H2,1-2H3
charge 0 multiplicity 1
51 atoms
O  4.885309 -1.961725 0.919108
O  5.729661 -0.377599 -0.546814
O  -6.197162 -0.251374 1.037227
C  1.456147 0.971598 0.324454
C  2.318553 -0.27488 -0.053822
C  0.051197 0.958999 -0.316359
C  -0.693533 -0.343727 0.123855
C  -2.165042 -0.4554 -0.455708
C  1.588189 -1.535919 0.460116
C  3.646527 0.098337 0.716655
C  0.155401 -1.624056 -0.130603
C  2.399315 2.173731 0.0754
C  -0.7666 2.202931 0.096077
C  3.813297 1.636701 0.486496
C  -2.916897 0.854845 -0.155229
C  2.603753 -0.379046 -1.575998
C  -2.201221 2.152028 -0.482668
C  -2.884904 -1.651843 0.243002
C  -2.163578 -0.668005 -2.004072
C  4.851244 -0.705509 0.282387
C  -4.419209 -1.643992 0.083676
C  -4.194624 0.879708 0.3454
C  -5.026537 -0.322487 0.550732
H  1.296904 0.908316 1.426851
H  0.159285 0.971055 -1.421844
H  -0.815235 -0.255866 1.229375
H  1.52601 -1.493489 1.567545
H  2.154742 -2.452776 0.20936
H  3.472339 -0.121369 1.787091
H  0.222711 -1.824036 -1.216745
H  -0.351179 -2.499347 0.316084
H  2.110942 3.063241 0.662391
H  2.382859 2.467724 -0.991409
H  -0.262966 3.1246 -0.251787
H  -0.815569 2.257233 1.203347
H  4.56527 1.821435 -0.299781
H  4.179843 2.124524 1.40689
H  3.203998 0.470228 -1.944782
H  3.170901 -1.301609 -1.799184
H  1.673314 -0.415276 -2.166529
H  -2.130488 2.250106 -1.58737
H  -2.797597 3.012557 -0.128303
H  -2.643816 -1.620868 1.325255
H  -2.483786 -2.604846 -0.148455
H  -1.604126 0.124846 -2.53103
H  -1.706489 -1.638167 -2.268207
H  -3.194635 -0.663519 -2.400217
H  -4.889162 -2.468697 0.648229
H  -4.702246 -1.788048 -0.97928
H  -4.682259 1.836681 0.573908
H  5.677649 -2.467348 0.588485
