program: Gaussian 09
title: 000099485
version: EM64L-G09RevD.01
frameworkgroup: C1[X(C15H27OP)]
method: RPBEPBE
basis: SDD
operation: Freq
keyword: #p
keyword: freq=noraman
keyword: PBEPBE/SDD
title: #p freq=noraman PBEPBE/SDD
converged: YES YES NO NO
title: Mulliken charges:
elementType: P O C C C C C C C C C C C C C C C H H H H H H H H H H H H H H H H H H H H H H H H H H H
charge: 1.009074 -0.675945 -0.440778 -0.456382 -0.455395 -0.440612 -0.403872 -0.400139 -0.403781 -0.421451 -0.388036 -0.415093 -0.441984 -0.442830 -0.433917 -0.431734 -0.437598 0.260496 0.251659 0.242061 0.249723 0.240176 0.229101 0.205328 0.276380 0.205301 0.220191 0.218818 0.267406 0.201217 0.217209 0.235083 0.212029 0.217486 0.208794 0.220397 0.218747 0.212439 0.196661 0.223652 0.219993 0.210509 0.197685 0.221930
chargesum: 0.00000
title: Mulliken charges with hydrogens summed into heavy atoms:
elementType: P O C C C C C C C C C C C C C C C
charge: 1.009074 -0.675945 -0.180282 -0.204724 -0.213333 0.049288 0.030558 0.081543 0.035229 0.047172 0.064256 0.014422 -0.012793 -0.011645 -0.013604 -0.001232 -0.017983
polarizability: 2.00891096e+02 9.75791155e-01 1.93045248e+02 -1.88042764e+00 1.60266954e+00 1.50378706e+02
1716.lowfreq: -7.7683 -4.5198 0.0002 0.0011 0.0020 9.4213 21.6282 42.2897 49.6112
frequency: 17.0725 41.8309 49.4535 54.9516 65.1771 74.5909 84.6043 101.8438 110.8111 157.4347 186.4027 187.0338 214.9880 229.8529 236.9583 246.6258 254.8514 314.3693 403.3233 459.3322 501.0589 508.1087 514.8835 589.1318 593.2889 602.9653 711.0324 724.1971 759.6190 774.7540 788.9767 801.6804 847.1863 850.0356 856.6471 887.2479 888.5699 890.0268 901.4818 904.1961 917.3672 934.0891 941.0542 942.5569 950.5328 953.2812 961.1726 975.8741 996.3295 997.1974 1006.4018 1055.5341 1056.4095 1059.0329 1071.3111 1078.7510 1092.1766 1118.5566 1129.5266 1143.9799 1161.3787 1165.6640 1176.3592 1189.4842 1192.8469 1199.0772 1227.4277 1231.9818 1244.8653 1253.0867 1255.7512 1258.2937 1261.0496 1268.7416 1273.5655 1288.7574 1291.9777 1292.6420 1297.9792 1301.2233 1304.4148 1307.2774 1308.1824 1311.0532 1320.6730 1324.7381 1328.2706 1464.7692 1466.6243 1468.0493 1469.9908 1470.8048 1472.2398 1472.7373 1475.0402 1477.7092 1487.3100 1489.5817 1493.5349 2978.9470 2982.4518 2986.3117 2987.1599 2987.9172 2988.0918 2991.3597 2993.3993 2993.7650 2995.2150 2996.5127 3004.1596 3007.0619 3009.4226 3028.3650 3045.3947 3048.0992 3049.0268 3054.5417 3056.2963 3057.1492 3061.5710 3063.0471 3070.1866 3079.1121 3079.6754 3092.7667
redmass: 2.6477 2.3882 2.5497 2.8092 2.6227 2.2105 3.2738 2.6683 2.6370 3.2894 3.0342 3.3303 2.7100 2.6741 3.6565 2.3259 3.8954 4.1363 2.8495 2.3968 3.3400 2.9849 4.0722 2.2989 2.3626 2.4651 3.0637 3.3584 2.9191 1.2430 1.2867 1.3831 1.8495 1.9417 1.8624 2.8039 2.7592 2.6693 2.2280 2.2841 2.1371 2.1625 2.0428 2.2869 1.9174 1.7298 1.7038 2.9449 1.3128 1.4262 1.3249 2.0404 2.2792 2.1257 3.9871 3.9829 4.2603 1.2640 1.2539 1.3005 1.5312 1.4960 1.3843 1.4609 1.4632 1.4631 1.3907 1.3691 1.2301 1.2011 1.2090 1.2105 1.2948 1.2694 1.2982 1.1847 1.1765 1.2313 1.2569 1.2986 1.2751 1.3190 1.3107 1.2536 1.4148 1.3678 1.3797 1.0842 1.0789 1.0850 1.0818 1.0817 1.0844 1.0886 1.0859 1.0842 1.0954 1.0952 1.0951 1.0651 1.0656 1.0631 1.0661 1.0668 1.0692 1.0628 1.0672 1.0724 1.0625 1.0781 1.0638 1.0642 1.0642 1.0635 1.1011 1.1001 1.0984 1.1028 1.1007 1.1010 1.1038 1.1046 1.1044 1.1050 1.1049 1.1033
irintensity: 0.0020 0.1234 0.0394 0.1880 0.5629 0.7976 0.0292 0.8594 0.4455 9.2928 4.8251 12.3068 0.3037 4.5170 0.1083 1.4494 1.3077 1.8876 3.3572 2.1213 22.6949 30.1985 52.7236 1.9152 1.8740 2.6578 3.3233 8.5925 13.9794 1.6114 6.6187 4.0467 2.1769 3.7178 1.9848 5.6338 2.2608 2.0040 11.3725 18.6084 19.2375 3.8954 7.2670 12.1387 6.6019 5.4598 4.9281 13.1070 4.8995 7.4061 3.6680 1.6504 0.1696 1.9458 1.5504 6.5924 3.1410 12.9192 2.8404 15.8613 0.3190 0.7083 1.5820 1.9462 1.1929 1.1624 0.9587 5.0438 4.2023 1.7674 2.5891 4.1800 1.6180 4.3307 3.4154 1.0688 8.1787 3.6566 0.9431 2.0068 0.5592 1.9846 1.2670 1.1288 4.8713 4.1576 4.4314 10.5554 3.2294 7.0999 13.1370 3.7607 10.5405 0.2201 5.1613 10.4543 2.5498 2.5582 3.7846 23.5338 10.4775 26.9988 14.2843 29.0813 41.5608 31.1820 47.1087 5.9782 16.3130 26.2361 56.8967 55.4085 52.8501 31.0811 26.3764 33.2924 26.4474 20.4907 25.0905 4.4309 22.3497 23.1554 37.1271 43.1377 98.9566 54.2630
temp: 298.150 k
press: 1.00000 atm
elementType: 15 8 6 6 6 6 6 6 6 6 6 6 6 6 6 6 6 1 1 1 1 1 1 1 1 1 1 1 1 1 1 1 1 1 1 1 1 1 1 1 1 1 1 1
symmnumber: 1
zpe: 1029984.1 jmol-1
zpe.correction: 0.392300 hartree
zpe.thermalcorrener: 0.410934 hartree
zpe.thermalcorrenthalpy: 0.411878 hartree
zpe.thermalcorrgfe: 0.343237 hartree
zpe.sumelectzpe: -1002.865067 hartree
zpe.sumelectthermal: -1002.846434 hartree
zpe.sumelectthermalent: -1002.845490 hartree
zpe.sumelectthermalfe: -1002.914130 hartree
dipole: -0.5366 -1.1064 -4.2364
dipole: 4.4112
quadrupole: -108.1099 -108.0824 -123.0042
quadrupole: -0.2429 -1.0505 -2.7236
quadrupole: 4.9556 4.9831 -9.9387 -0.2429 -1.0505 -2.7236
hfenergy: -1003.2573674 hartree
pointgroup: C01 [X(C15H27O1P1)]
dipole: -0.1934661 -0.4572146 -1.6629814 debye
polarizability: 200.8548562|1.1397818|193.1242684|-1.7159408|1.1258467|150.3359256 unknown
InChI: InChI=1S/C15H27OP/c16-17(13-7-1-2-8-13,14-9-3-4-10-14)15-11-5-6-12-15/h13-15H,1-12H2
charge 0 multiplicity 1
44 atoms
P  0.095244 0.051022 0.495373
O  0.229923 0.443513 2.06709
C  -0.695399 -1.656189 0.2367
C  1.790394 -0.01463 -0.382674
C  -0.937008 1.334979 -0.459102
C  -1.98359 -1.888852 1.079608
C  -1.103084 -2.0305 -1.209868
C  2.775207 1.050081 0.205593
C  2.532741 -1.370526 -0.230937
C  -2.272822 1.682652 0.27091
C  -0.210514 2.700472 -0.59257
C  -2.791442 -2.985652 0.300605
C  -1.964669 -3.299937 -0.985758
C  4.171953 0.347252 0.283421
C  4.008303 -0.985429 -0.495289
C  -2.531076 3.204156 -0.004286
C  -1.369299 3.669648 -0.928945
H  0.080149 -2.371924 0.575752
H  1.598342 0.180451 -1.456918
H  -1.133946 0.92491 -1.469687
H  -2.573523 -0.959556 1.16152
H  -1.730022 -2.191683 2.10857
H  -0.239595 -2.205642 -1.87728
H  -1.72606 -1.232584 -1.660596
H  2.431594 1.360761 1.209897
H  2.806666 1.949889 -0.433436
H  2.154431 -2.150542 -0.916282
H  2.434124 -1.745889 0.80771
H  -2.155463 1.504925 1.356166
H  -3.103451 1.049195 -0.089033
H  0.584607 2.695733 -1.359234
H  0.245969 2.974935 0.378526
H  -3.793194 -2.603871 0.030582
H  -2.94625 -3.892816 0.910983
H  -1.301279 -4.168693 -0.812294
H  -2.604413 -3.539878 -1.853938
H  4.426427 0.132061 1.3378
H  4.980684 0.976931 -0.128272
H  4.165086 -0.822801 -1.579839
H  4.719011 -1.764887 -0.166267
H  -2.507735 3.767135 0.946502
H  -3.519016 3.382277 -0.465138
H  -1.653816 3.554663 -1.993166
H  -1.097587 4.72864 -0.769799
