program: Gaussian 09
title: 000099467
version: EM64L-G09RevD.01
frameworkgroup: C1[X(C15H10F3NO3)]
method: RPBEPBE
basis: SDD
operation: Freq
keyword: #p
keyword: freq=noraman
keyword: PBEPBE/SDD
title: #p freq=noraman PBEPBE/SDD
converged: YES YES NO NO
title: Mulliken charges:
elementType: F F F O O O N C C C C C C C C C C C C C C C H H H H H H H H H H
charge: -0.167134 -0.167245 -0.169314 -0.282556 -0.422600 -0.309065 -0.479749 0.492896 0.106404 0.353557 -0.587050 0.129226 0.139719 -0.347693 -0.366469 -0.196064 -0.308925 0.247775 -0.304688 -0.226626 -0.224828 0.154216 0.275095 0.382178 0.319137 0.261999 0.235413 0.293586 0.281879 0.244208 0.244533 0.398185
chargesum: 0.00000
title: Mulliken charges with hydrogens summed into heavy atoms:
elementType: F F F O O O N C C C C C C C C C C C C C C C
charge: -0.167134 -0.167245 -0.169314 -0.282556 -0.024415 -0.309065 -0.097571 0.492896 0.106404 0.353557 -0.311955 0.129226 0.139719 -0.028555 -0.104471 0.039349 -0.015338 0.247775 -0.022808 0.017582 0.019705 0.154216
polarizability: 3.11480489e+02 2.40519524e+00 1.98041106e+02 9.34634884e+00 -8.80023480e-01 8.04213225e+01
1716.lowfreq: -7.2991 -5.4964 -0.0009 -0.0005 -0.0003 4.0163 5.2664 16.2544 37.0352
frequency: -4.7463 16.1915 36.9146 50.5308 58.3714 98.0677 106.7641 132.9045 148.9684 192.0393 193.6106 250.1554 269.7398 274.3911 308.8757 319.8359 346.9580 395.1341 402.0405 406.2387 427.8608 432.6190 454.4209 495.4286 520.6897 540.0305 583.0949 606.1914 610.5225 617.7985 627.6826 650.0605 677.4144 698.2538 700.1522 705.9942 772.4435 780.5228 796.1009 813.7136 862.1727 865.7790 898.5215 918.3636 935.4249 958.0801 983.4024 983.8974 994.6996 1006.0231 1014.6833 1016.9190 1021.0265 1040.4634 1058.8023 1091.5384 1103.8221 1130.6818 1155.1828 1183.4844 1184.7037 1217.3383 1260.0506 1276.3501 1307.0378 1319.8180 1329.8782 1373.4382 1389.9746 1416.4385 1435.8595 1470.3076 1485.7176 1553.4190 1571.4000 1579.6485 1596.9479 1606.4362 1623.0223 1662.1932 3142.7998 3145.5417 3148.1569 3150.2930 3160.3585 3172.8173 3173.1454 3188.2431 3201.5395 3524.3039
redmass: 16.9922 6.7919 6.4364 9.6155 9.9076 7.7834 4.4782 7.3476 9.2743 5.3648 8.5659 6.7818 7.0491 4.9505 6.9526 8.1941 9.6555 5.6640 8.0349 8.8647 4.9801 4.2197 4.9863 4.7843 10.4380 6.2059 6.5189 1.4674 6.5482 4.4157 6.0348 6.0671 4.1963 5.6001 2.1976 3.6670 5.7175 4.5395 1.5341 1.4375 5.7553 5.9710 1.5273 1.4213 1.3776 1.2074 6.5678 9.5282 1.3832 1.3516 5.7694 1.3760 5.5413 4.7664 2.7317 2.8796 1.6609 1.8331 1.9061 1.0728 1.0968 2.5395 2.6581 1.5310 2.1759 2.0381 2.7937 10.2294 6.0793 2.0721 3.6824 2.4473 2.8037 6.6777 5.2771 4.9460 7.1341 6.0271 5.8422 1.6153 1.0871 1.0876 1.0882 1.0923 1.0919 1.0962 1.0957 1.0965 1.0951 1.0642
irintensity: 0.0467 0.0844 1.5016 3.5765 0.8023 0.9472 2.0189 0.2259 4.0050 0.3173 2.0773 4.7686 3.2522 1.6226 0.6464 5.6931 4.2029 1.6452 5.3833 15.8733 0.3367 8.9959 2.6497 6.3055 1.5602 2.0043 35.8005 87.4910 25.1777 53.2082 5.1037 4.1438 1.9270 33.1697 15.7409 86.0724 4.2783 4.4533 46.6767 62.6373 8.4718 53.5161 14.9514 1.0260 1.3345 162.6928 53.5060 172.2959 5.5734 9.6270 138.1423 2.6040 197.3073 128.9195 36.2211 97.6845 0.0897 25.1303 101.8958 3.2031 3.6078 108.2859 84.4102 38.1105 123.2670 129.1612 120.3403 35.3626 26.7231 0.3855 17.2593 49.0014 94.9914 333.8532 76.0705 257.4768 260.6947 7.9886 8.9357 40.5860 22.9645 550.2133 35.2023 7.9543 6.2901 5.9287 14.3678 9.0124 7.1524 71.2367
temp: 298.150 k
press: 1.00000 atm
elementType: 9 9 9 8 8 8 7 6 6 6 6 6 6 6 6 6 6 6 6 6 6 6 1 1 1 1 1 1 1 1 1 1
symmnumber: 1
zpe: 582634.5 jmol-1
zpe.correction: 0.221914 hartree
zpe.thermalcorrener: 0.239632 hartree
zpe.thermalcorrenthalpy: 0.240576 hartree
zpe.thermalcorrgfe: 0.174274 hartree
zpe.sumelectzpe: -1156.038050 hartree
zpe.sumelectthermal: -1156.020332 hartree
zpe.sumelectthermalent: -1156.019388 hartree
zpe.sumelectthermalfe: -1156.085690 hartree
dipole: 6.3002 1.0807 -0.0067
dipole: 6.3922
quadrupole: -115.3730 -115.5475 -130.0104
quadrupole: 15.8024 5.9632 -2.9315
quadrupole: 4.9373 4.7628 -9.7001 15.8024 5.9632 -2.9315
hfenergy: -1156.259964 hartree
pointgroup: C01[X(C15H10F3N1O3)]
dipole: -2.4849247 -0.3670594 -0.1226349 debye
polarizability: 306.5816361|28.5032425|107.1215683|-19.3004418|44.710966|176.2397132 unknown
InChI: InChI=1S/C15H10F3NO3/c16-15(17,18)9-4-3-5-10(8-9)19-13(20)11-6-1-2-7-12(11)14(21)22/h1-8,19,21H
charge 0 multiplicity 1
32 atoms
F  5.50852 0.584308 -1.597609
F  5.121798 -1.473706 -0.742323
F  3.872193 -0.724399 -2.476223
O  -1.168565 1.265834 2.109473
O  -3.154093 -1.108929 -2.854008
O  -1.113619 -1.068212 -1.821404
N  -0.168456 0.098999 0.353219
C  1.185674 0.476794 0.538402
C  -2.649137 -0.06512 0.732297
C  3.482658 0.276019 -0.290462
C  2.116868 -0.046532 -0.399761
C  -1.260952 0.491031 1.100907
C  -3.161903 -0.634145 -0.493308
C  1.647621 1.324125 1.584024
C  3.95236 1.118167 0.746702
C  3.021933 1.633409 1.671796
C  -3.568997 0.098558 1.804608
C  4.466049 -0.315235 -1.257733
C  -4.544606 -0.980415 -0.576828
C  -4.922043 -0.276331 1.714803
C  -5.41948 -0.817397 0.50969
C  -2.368294 -0.9323 -1.719238
H  1.770462 -0.691065 -1.214781
H  -0.363533 -0.501417 -0.476054
H  0.927435 1.725857 2.297882
H  5.014618 1.36962 0.816961
H  3.368731 2.289669 2.476666
H  -3.177218 0.561096 2.7150
H  -4.91583 -1.389599 -1.519034
H  -5.582248 -0.137826 2.577373
H  -6.471175 -1.105336 0.414363
H  -2.562569 -1.340022 -3.620401
