program: Gaussian 09
title: 000099526
version: EM64L-G09RevD.01
frameworkgroup: C1[X(C23H32O4)]
method: RPBEPBE
basis: SDD
operation: Freq
keyword: #pfreq=noraman
keyword: PBEPBE/SDD
title: #p freq=noraman PBEPBE/SDD
converged: NO YES NO NO
title: Mulliken charges:
elementType: O O O O C C C C C C C C C C C C C C C C C C C C C C C H H H H H H H H H H H H H H H H H H H H H H H H H H H H H H H H
charge: -0.449018 -0.218533 -0.438558 -0.211620 0.222363 0.375767 -0.179698 -0.115082 -0.209770 0.256400 -0.533788 -0.606429 -0.526850 -0.495775 -0.467095 0.484273 -0.860331 -0.642841 -0.489115 0.372066 -0.816238 -0.506863 -0.540953 -0.073731 -0.454661 -0.527544 0.167549 0.208322 0.213101 0.192220 0.223143 0.205777 0.227402 0.250541 0.216105 0.229222 0.257998 0.221634 0.241665 0.226024 0.244533 0.221997 0.230652 0.211708 0.228598 0.206512 0.208560 0.333508 0.217263 0.225096 0.229889 0.195192 0.225020 0.249274 0.228239 0.242501 0.237799 0.312628 0.323955
chargesum: 0.00000
title: Mulliken charges with hydrogens summed into heavy atoms:
elementType: O O O O C C C C C C C C C C C C C C C C C C C C C C C
charge: -0.115510 -0.218533 -0.114603 -0.211620 0.222363 0.375767 0.028623 0.098018 -0.017550 0.256400 -0.104868 -0.128486 -0.081524 -0.016143 0.000593 0.484273 -0.163149 -0.202535 -0.074043 0.372066 -0.143989 -0.086651 -0.291679 0.154508 0.025640 -0.214916 0.167549
polarizability: 3.32170514e+02 9.40219148e+00 2.25330594e+02 -1.63143663e+01 -6.82042832e+00 1.96797503e+02
1716.lowfreq: -18.1199 -1.5558 0.0001 0.0004 0.0007 2.9120 25.0712 28.5711 47.6528
frequency: 25.0695 28.5066 47.5927 53.3545 68.2627 97.6726 123.3392 146.6572 161.9185 166.8396 179.5394 188.3531 195.4534 208.0053 214.3353 236.9739 240.0345 261.9317 272.2663 273.8571 291.9514 298.2030 313.0835 318.2593 329.4452 335.1326 351.5574 372.1356 377.8905 397.4433 424.0858 435.3497 447.6890 460.0835 466.4074 485.2008 496.0067 506.0595 547.3985 559.0311 562.5665 575.5419 613.1972 623.3701 650.6765 660.9972 678.9496 698.1347 709.6179 757.6721 796.0010 801.5459 806.2837 811.9212 819.4803 844.3600 853.9694 863.9833 881.1556 895.2207 902.3836 911.4733 918.1285 931.0872 934.7722 947.1923 957.0801 966.2672 968.1342 981.4676 991.2176 1002.7661 1012.4012 1022.6798 1029.1600 1031.1233 1048.0613 1054.5787 1069.1822 1073.0862 1088.3466 1095.2458 1110.5465 1117.7743 1127.6213 1128.5975 1135.9368 1140.7874 1149.6955 1152.2436 1164.2966 1179.6855 1180.6271 1185.9547 1196.6640 1203.5499 1219.9005 1228.6737 1236.1193 1240.5717 1246.3074 1254.9310 1259.5932 1277.1341 1285.7638 1294.5672 1298.9963 1304.1405 1311.2091 1316.3648 1321.2961 1328.7750 1331.9925 1338.5933 1340.3693 1341.0838 1347.2550 1355.9522 1361.1098 1365.8642 1377.1857 1388.1150 1389.0547 1443.5390 1455.7232 1459.4711 1464.8152 1467.4902 1469.8833 1470.8232 1473.7733 1479.3070 1482.1975 1482.3027 1489.9400 1496.1816 1633.9827 1666.6983 1702.5743 2914.0319 2933.8870 2956.3497 2963.6293 2966.1679 2974.4345 2978.4864 2982.6031 2982.9442 2985.5191 2988.9638 2992.7464 3007.4516 3014.6948 3020.5960 3027.3937 3033.5016 3036.7684 3039.4175 3048.2500 3053.0027 3055.2178 3061.8680 3076.6518 3077.0959 3077.4917 3079.0634 3096.5289 3096.9021 3220.7508 3538.4205 3548.6173
redmass: 5.4769 6.3080 4.5588 4.3170 4.3489 4.1676 3.7200 3.4082 2.6798 3.5611 1.8544 2.3399 1.3775 3.4787 2.0043 2.2318 2.7802 2.7716 3.0844 3.0565 2.5114 2.1324 1.8268 2.6437 1.4873 2.4576 1.9116 1.9042 2.6973 3.0060 3.1915 3.3534 2.8426 3.6923 4.1064 3.2096 2.8222 3.3281 2.8472 2.9806 2.9262 2.5859 3.7936 2.4079 6.0639 3.4492 5.2658 4.0017 4.0238 2.5097 4.9643 1.9230 1.9520 2.7386 2.2415 2.3542 2.2398 1.5087 2.3530 1.6636 2.3978 1.7461 2.0504 2.5352 2.2221 1.8866 2.1296 5.0794 2.4388 1.8963 2.0041 2.4190 2.0191 2.1737 2.2293 1.9951 1.9319 1.8251 2.4898 2.4303 2.8099 2.1800 1.6666 2.0874 1.8866 1.3021 2.5106 1.5634 2.0433 2.0012 2.2091 2.0037 1.7782 1.5117 1.4600 1.6434 1.3282 1.5600 1.6583 1.7557 1.3793 1.4656 1.5533 1.4257 1.4044 1.3656 1.4764 1.2883 1.4719 1.4113 1.4101 1.4217 1.8785 1.3697 1.4464 1.5222 1.4572 1.3215 1.4018 1.4121 1.5412 1.2162 1.2858 1.0861 1.0854 1.0764 1.0861 1.0753 1.0888 1.0821 1.0737 1.0847 1.0647 1.0650 1.0582 1.0614 6.9684 8.4083 12.3083 1.0792 1.0832 1.0652 1.0635 1.0648 1.0727 1.0419 1.0603 1.0617 1.0403 1.0579 1.0608 1.0830 1.0659 1.0928 1.0662 1.0970 1.0944 1.1050 1.1008 1.1014 1.0995 1.0973 1.0985 1.1004 1.0984 1.0982 1.1021 1.0906 1.0984 1.0659 1.0654
irintensity: 2.4074 2.6030 0.2410 0.1874 0.7048 1.9859 0.8431 0.7073 0.2122 0.8197 0.5258 2.7941 1.2313 0.6824 0.0121 2.9264 6.3441 0.1231 13.3127 1.2662 12.9369 5.4746 20.9439 11.4093 97.6838 43.2540 63.4922 28.1185 6.0365 1.8412 10.4568 4.2683 5.3801 2.7218 2.9340 5.7434 1.0947 3.5099 0.9638 7.6727 0.4045 5.0995 2.6898 1.0362 1.1608 4.1628 1.6112 0.9383 0.4592 2.9687 60.5714 1.0204 3.1094 10.1585 4.0240 4.3911 14.6797 35.5406 24.7484 24.6179 38.9214 2.9862 36.0445 8.7329 19.3448 13.0789 28.8006 30.8303 20.6534 8.9927 4.5884 23.2202 14.3675 1.6042 3.2599 7.3788 9.3677 11.7976 1.4021 14.4187 103.3321 5.0995 2.5971 8.3225 3.9301 3.8525 2.2297 9.5322 12.4308 1.3626 12.9140 8.1372 4.0638 7.7363 14.9896 5.4680 4.7485 14.0628 3.2917 13.6285 1.0854 20.7869 17.0158 0.4668 0.3092 5.8206 0.7190 4.5775 3.7505 7.1495 1.8158 2.4766 0.4169 0.8765 1.1298 3.1855 1.1214 21.0311 20.4467 30.7986 12.5632 28.9729 16.1339 9.9059 3.9821 3.4112 20.6880 19.0229 2.4454 6.8629 13.8589 7.0583 2.0970 8.1608 1.5176 20.1125 64.5474 12.8455 531.9150 6.6396 28.2979 24.9766 34.2795 13.3160 36.1351 19.0920 40.4254 10.6162 25.5651 31.7142 26.0757 18.5500 26.1817 26.7463 32.1224 50.7602 51.4048 14.5694 30.2187 29.1965 61.3789 39.3146 30.3167 5.9052 24.2395 35.2804 21.8716 21.4869 1.4880 5.6830 4.4135
temp: 298.150 k
press: 1.00000 atm
elementType: 8 8 8 8 6 6 6 6 6 6 6 6 6 6 6 6 6 6 6 6 6 6 6 6 6 6 6 1 1 1 1 1 1 1 1 1 1 1 1 1 1 1 1 1 1 1 1 1 1 1 1 1 1 1 1 1 1 1 1
symmnumber: 1
zpe: 1326335.1 jmol-1
zpe.correction: 0.505174 hartree
zpe.thermalcorrener: 0.530460 hartree
zpe.thermalcorrenthalpy: 0.531404 hartree
zpe.thermalcorrgfe: 0.451823 hartree
zpe.sumelectzpe: -1194.452735 hartree
zpe.sumelectthermal: -1194.427449 hartree
zpe.sumelectthermalent: -1194.426505 hartree
zpe.sumelectthermalfe: -1194.506086 hartree
dipole: -5.0093 -3.4663 0.5699
dipole: 6.1183
quadrupole: -250.2738 -160.3043 -157.0622
quadrupole: -11.9233 24.6183 -1.7094
quadrupole: -61.0603 28.9091 32.1513 -11.9233 24.6183 -1.7094
hfenergy: -1194.957909 hartree
pointgroup: C01 [X(C23H32O4)]
dipole: -2.0034063 1.3257638 -0.1514173 debye
polarizability: 332.2914169|-7.762409|225.6646486|17.1609531|-4.5010515|196.3425454 unknown
InChI: InChI=1S/C23H32O4/c1-21-8-5-16(24)12-15(21)3-4-19-18(21)6-9-22(2)17(7-10-23(19,22)26)14-11-20(25)27-13-14/h11-12,16-19,24,26H,3-10,13H2,1-2H3
charge 0 multiplicity 1
59 atoms
O  1.577095 -1.667746 0.349347
O  6.209242 1.096462 0.516015
O  -7.227936 -0.423153 -0.400436
O  6.837336 -1.093183 1.08777
C  0.759849 -0.568875 -0.243209
C  1.459638 0.818608 0.012875
C  -0.68998 -0.669717 0.320656
C  -1.597091 0.533147 -0.079072
C  2.69954 0.808418 -0.998182
C  -3.055821 0.440549 0.536087
C  0.493255 1.956778 -0.442711
C  0.915184 -0.789811 -1.760626
C  -0.89792 1.881833 0.221033
C  2.332335 -0.25819 -2.095259
C  -1.356617 -2.007515 -0.081657
C  -3.639023 -0.949631 0.210149
C  1.853991 1.032631 1.492214
C  -2.759977 -2.141914 0.554146
C  -3.940464 1.555447 -0.109712
C  4.050666 0.562204 -0.370406
C  -3.040336 0.63039 2.085982
C  -5.45409 1.290488 0.030872
C  -4.86189 -1.122987 -0.366809
C  -5.834177 -0.009617 -0.700719
C  5.013587 1.704783 -0.09677
C  4.638239 -0.598658 0.042125
C  5.983731 -0.331269 0.603657
H  -0.593238 -0.665195 1.431324
H  -1.740879 0.472057 -1.182045
H  2.738168 1.816747 -1.459002
H  0.370021 1.918202 -1.543514
H  0.968239 2.932694 -0.216171
H  0.131947 -0.239208 -2.310314
H  0.81165 -1.858933 -2.007837
H  -0.795335 2.025952 1.313549
H  -1.514657 2.721419 -0.149989
H  3.055066 -1.088324 -2.055803
H  2.386007 0.174637 -3.10976
H  -0.710774 -2.853101 0.217974
H  -1.459637 -2.047705 -1.184162
H  2.639521 0.329343 1.819083
H  2.24595 2.055068 1.64936
H  0.985672 0.916973 2.166245
H  -2.643573 -2.220181 1.65606
H  -3.243913 -3.077877 0.219525
H  -3.694009 1.627033 -1.189902
H  -3.694287 2.535757 0.339965
H  1.56538 -1.570207 1.336035
H  -2.396181 -0.108167 2.595076
H  -2.68388 1.638897 2.361534
H  -4.058746 0.511927 2.49637
H  -5.728107 1.191912 1.100739
H  -6.041174 2.134589 -0.374225
H  -5.212114 -2.136424 -0.611761
H  -5.874423 0.161935 -1.793363
H  5.320731 2.22312 -1.02535
H  4.599728 2.451307 0.608359
H  4.21157 -1.599792 0.002823
H  -7.270692 -0.673026 0.558918
