program: Gaussian 09
title: 000099418
version: EM64L-G09RevD.01
frameworkgroup: C1[X(C7H8ClN3O)]
method: RPBEPBE
basis: SDD
operation: Freq
keyword: #p
keyword: freq=noraman
keyword: PBEPBE/SDD
title: #p freq=noraman PBEPBE/SDD
converged: YES YES NO NO
title: Mulliken charges:
elementType: Cl O N N N C C C C C C C H H H H H H H H
charge: -0.056473 -0.236434 -0.493051 -0.399933 -0.000097 0.253036 -0.342380 0.285340 -0.096727 -0.050593 -0.359514 -0.599143 0.303773 0.232679 0.262076 0.300398 0.266479 0.223441 0.278028 0.229094
chargesum: 0.00000
title: Mulliken charges with hydrogens summed into heavy atoms:
elementType: Cl O N N N C C C C C C C
charge: -0.056473 -0.236434 -0.189278 -0.099535 -0.000097 0.253036 -0.109702 0.285340 0.165350 -0.050593 -0.093034 0.131420
polarizability: 1.90294714e+02 -6.05172704e+00 9.78752439e+01 5.50185802e+00 1.52582273e+00 5.67101386e+01
1716.lowfreq: -13.2658 -4.3321 -0.0020 -0.0014 -0.0010 3.7897 40.2443 49.5491 81.9853
frequency: 40.2435 49.5349 81.9675 102.4380 130.2272 168.5868 242.9906 259.0525 297.0241 325.9303 398.6158 418.3648 437.2559 453.7846 500.2427 518.9273 611.9586 664.4297 676.4581 735.5668 752.7783 816.8747 860.3726 906.8842 924.5235 948.4359 966.4618 1082.1067 1098.2067 1125.4642 1132.2750 1137.1325 1199.7019 1251.0286 1314.5342 1318.0595 1348.3568 1423.9009 1445.7842 1452.0404 1460.5081 1485.5355 1510.2629 1559.0368 1576.6469 1671.6811 2978.3270 3056.8942 3112.2604 3137.3371 3150.8743 3174.4466 3546.0069 3557.6343
redmass: 5.5391 5.5582 4.0991 1.1317 6.0038 3.7577 8.3371 5.1932 5.7591 4.8192 4.5351 3.9801 3.8823 1.4262 2.1974 1.4162 7.8594 8.8792 5.3250 5.3149 4.0915 1.6396 5.5552 1.4208 3.9251 1.3544 5.3480 3.4679 3.1221 1.2887 1.3059 1.5624 2.0111 1.8125 2.1020 4.3660 2.7258 1.1617 1.6766 2.6625 1.5732 1.0638 1.3269 5.3945 6.8142 6.8828 1.0355 1.1024 1.0979 1.0908 1.0929 1.0968 1.0767 1.0771
irintensity: 3.4454 2.3803 1.4794 0.4881 0.2996 5.3124 1.2249 0.3531 11.1659 15.9427 18.8769 8.5089 20.9375 103.4319 53.9230 133.6921 2.2589 30.0394 1.1581 15.9649 10.7997 56.4792 5.1095 4.4702 9.0489 0.1430 16.1053 103.9040 10.3777 1.7355 27.3372 31.1077 338.3161 26.6485 3.1139 84.8823 15.2730 30.5113 380.6177 363.8951 36.5186 24.4197 163.5658 111.9669 41.9095 216.9803 90.0720 40.3648 2.5311 14.0229 7.0188 2.9205 12.8265 30.3770
temp: 298.150 k
press: 1.00000 atm
elementType: 17 8 7 7 7 6 6 6 6 6 6 6 1 1 1 1 1 1 1 1
symmnumber: 1
zpe: 386369.7 jmol-1
zpe.correction: 0.147160 hartree
zpe.thermalcorrener: 0.158973 hartree
zpe.thermalcorrenthalpy: 0.159918 hartree
zpe.thermalcorrgfe: 0.107803 hartree
zpe.sumelectzpe: -970.208180 hartree
zpe.sumelectthermal: -970.196367 hartree
zpe.sumelectthermalent: -970.195423 hartree
zpe.sumelectthermalfe: -970.247538 hartree
dipole: -2.7766 5.1143 -1.9893
dipole: 6.1500
quadrupole: -65.9513 -70.6919 -79.6168
quadrupole: -5.6424 7.5905 1.7397
quadrupole: 6.1353 1.3948 -7.5301 -5.6424 7.5905 1.7397
hfenergy: -970.3553408 hartree
pointgroup: C01 [X(C7H8Cl1N3O1)]
dipole: -1.0019484 -2.0846562 0.7104766 debye
dipolederiv: -0.9270236 -0.2031819 -0.0200296 -0.2209969 -0.169809 -0.0203079 -0.0180093 -0.0143022 -0.0616135 -0.760538 0.0296058 0.0554454 0.2327569 -0.696783 0.3276987 0.0873776 0.2895501 -0.5998322 -2.3022418 0.0812407 -0.0682891 0.390292 -0.3042977 0.0737613 -0.1276391 0.0950967 -0.5018086 -1.467712 -0.134915 0.2082358 -0.2479069 -0.5249325 -0.0479034 0.2592631 -0.0753978 -0.4208908 -0.6188752 -0.0149225 0.0320678 -0.4646136 -0.27873 -0.0266816 0.03133 -0.0389638 -0.2043717 1.9880783 0.2525365 0.0477769 0.52092 0.1125122 0.0718066 -0.137385 0.0288352 0.1575959 -0.5660742 -0.1124637 -0.0345298 0.260408 0.0167706 0.0510705 0.0231926 0.0589292 -0.1538794 2.6092721 -0.0708332 -0.2529745 -0.6943298 0.9406009 -0.5744501 -0.4424544 -0.4774042 0.7535596 0.0357834 -0.0015775 0.0042521 0.0180075 0.1201679 0.0508024 -0.0197394 0.0503352 -0.0588727 1.1157454 0.4120841 0.0620169 0.2067131 -0.0723205 -0.0278858 -0.002116 -0.0266074 -0.068628 0.0517976 -0.1501399 -0.0648889 0.0718968 0.2913322 0.0711687 0.0372375 0.0701404 -0.0023174 0.539946 -0.0483521 0.0090101 -0.2647361 0.1795555 0.1398603 0.1779051 0.1241003 0.1254811 0.072218 0.0141441 -0.0163776 0.0655912 0.1074682 0.0337207 0.1514152 0.0073927 0.3390971 0.0563094 -0.0722968 -0.0101214 -0.0639583 -0.0696695 -0.0651952 -0.0026142 -0.0680658 0.1512787 0.025721 0.0716839 0.0219009 0.0652735 0.0519427 -0.0287502 0.0302294 -0.0228485 0.1516076 0.1478879 0.0605751 -0.0130896 0.1431376 0.2347354 0.1186441 -0.0065485 0.1398327 0.1981639 0.0622933 -0.0460606 -0.0108442 -0.0720856 -0.0261166 -0.0362364 -0.0252561 -0.0356612 0.1233157 -0.1702169 -0.0719346 -0.0464592 -0.1205839 -0.0275928 -0.074833 -0.0852148 -0.0602911 0.0975181 0.1787251 -0.0443589 0.0512275 0.0457123 0.0657631 0.0688288 -0.0333058 0.077519 0.04635 -0.071096 0.0491664 0.0456705 0.1285021 0.0494028 -0.1051186 0.1023321 -0.1221898 -0.0717536 unknown
polarizability: 189.5685118|11.0325229|98.716151|-1.809745|2.4494364|56.5954332 unknown
InChI: InChI=1S/C7H8ClN3O/c1-9-7(12)11-6-3-2-5(8)4-10-6/h2-4,9,11H,1H3
charge 0 multiplicity 1
20 atoms
Cl 4.585274 0.746694 0.14173
O  -2.172617 0.976699 -1.020501
N  -1.16991 -0.902172 0.04556
N  -3.454234 -0.482159 0.292641
N  0.504014 0.755133 0.33548
C  0.190409 -0.53658 0.026852
C  1.18313 -1.517803 -0.258187
C  -2.262939 -0.031522 -0.275651
C  2.539572 -1.142205 -0.215061
C  2.849929 0.200126 0.08516
C  1.813448 1.119786 0.345843
C  -4.732815 0.173393 -0.002296
H  -1.377335 -1.899148 0.126024
H  0.902539 -2.542544 -0.524686
H  3.330311 -1.867474 -0.426645
H  -3.409683 -1.145527 1.067146
H  2.03051 2.166762 0.581658
H  -5.489166 -0.559456 -0.337856
H  -4.554287 0.903635 -0.807365
H  -5.123752 0.718662 0.877353
