program: Gaussian 09
title: 000099414
version: EM64L-G09RevD.01
frameworkgroup: C1[X(C13H19N3O3)]
method: RPBEPBE
basis: SDD
operation: Freq
keyword: #p
keyword: freq=noraman
keyword: PBEPBE/SDD
title: #p freq=noraman PBEPBE/SDD
converged: YES YES NO NO
title: Mulliken charges:
elementType: O O O N N N C C C C C C C C C C C C C H H H H H H H H H H H H H H H H H H H
charge: -0.344568 -0.289576 -0.300389 -0.419607 -0.495488 -0.424144 0.303888 -0.746467 -0.690641 -0.690616 0.278113 0.415771 0.521171 -0.572439 -0.450627 -0.378780 -0.176118 0.303644 -0.603714 0.221748 0.229008 0.221699 0.261915 0.212573 0.206784 0.212475 0.206903 0.262014 0.331804 0.293777 0.251390 0.309188 0.225923 0.294107 0.291169 0.223585 0.223235 0.281291
chargesum: 0.00000
title: Mulliken charges with hydrogens summed into heavy atoms:
elementType: O O O N N N C C C C C C C C C C C C C
charge: -0.344568 -0.289576 -0.300389 -0.087803 -0.201381 -0.132975 0.303888 -0.074012 -0.009369 -0.009225 0.278113 0.415771 0.521171 -0.278662 -0.199237 -0.069592 0.049805 0.303644 0.124397
polarizability: 2.64906034e+02 -1.21637227e+01 1.90938052e+02 5.31115991e-02 -1.63726842e-01 9.99105655e+01
1716.lowfreq: -6.9591 -5.0136 -0.0006 -0.0004 0.0004 2.4957 13.0264 30.6098 51.0658
frequency: 12.4909 30.5955 51.0468 52.9610 54.6518 79.6042 112.6937 121.4531 122.8186 142.1073 173.7085 201.8313 223.8260 227.2049 237.5337 263.7300 265.2633 286.7592 300.6996 322.3036 333.0055 363.4160 381.0766 382.2895 420.1427 443.2965 448.7053 452.9529 540.9112 576.6945 579.2311 612.0585 617.5433 682.6910 689.4861 696.4398 705.1893 716.2345 747.0416 790.8331 797.2450 884.8397 895.6163 904.1804 906.3978 914.3042 927.1105 950.2900 952.8400 982.9402 986.2657 1014.3023 1035.0794 1040.6891 1084.4650 1111.6760 1127.6791 1134.6120 1144.8475 1170.4156 1178.5590 1220.1033 1233.8730 1236.5314 1260.7893 1279.6976 1308.6116 1374.4660 1376.1792 1382.3147 1399.9947 1413.0602 1424.5337 1452.6399 1455.2668 1460.5384 1467.5128 1472.2118 1480.8075 1485.3730 1486.9998 1488.9644 1502.6531 1512.0698 1526.4341 1604.7178 1611.7320 1649.5666 1674.7001 2973.2886 2977.6577 2985.6311 2990.0282 3049.7861 3070.2985 3081.8445 3085.5116 3096.5975 3101.2561 3105.6957 3107.7400 3141.2447 3171.8043 3174.2515 3200.1255 3525.7591 3554.7682 3558.5939
redmass: 3.4997 4.6644 3.7991 4.5122 4.7333 6.3450 3.5802 3.8401 1.1866 2.7850 4.7956 1.0262 4.1504 3.0781 5.6931 1.0523 1.0438 4.1044 4.9947 4.1052 2.3593 4.6448 4.3823 1.3579 3.1489 2.8268 2.9353 3.0770 1.1448 1.5258 5.4178 6.3385 2.5019 6.9918 6.0652 2.7314 10.3412 5.8925 4.8772 4.3872 1.4187 5.2810 1.5224 3.0901 1.3775 1.7013 1.6668 4.0006 1.2033 6.1786 1.3053 3.5679 1.3848 1.4647 1.5298 2.9031 1.2750 1.5541 2.5510 1.6677 1.3703 1.9943 2.5376 3.0499 3.4436 2.2814 1.6866 1.2066 1.2078 4.2277 1.2335 3.5144 1.1698 1.0469 1.4452 1.3386 1.0616 1.0476 1.4596 1.0573 1.9028 1.0455 1.0730 1.4605 2.0433 6.2061 6.1893 4.2835 9.5295 1.0354 1.0363 1.0352 1.0361 1.1028 1.1004 1.1002 1.0996 1.0982 1.1003 1.0996 1.0972 1.0885 1.0925 1.0953 1.0952 1.0761 1.0772 1.0773
irintensity: 2.4251 1.3955 11.0432 1.5946 3.6640 2.6856 1.4207 4.4205 0.3763 3.8369 0.1649 0.0781 5.5403 0.3884 0.0035 0.0472 0.0821 7.6084 4.5578 11.7494 0.0741 23.2916 3.2683 31.3135 0.4235 3.8260 5.8801 3.5747 102.4661 107.0764 1.1769 5.4985 62.7248 2.3851 3.0498 54.8853 10.1147 4.2758 3.4771 1.3776 52.0504 27.5938 62.5999 51.1823 1.2906 0.4828 3.8340 22.0271 0.4326 1.9348 4.8138 245.7492 0.0839 5.9627 23.3364 30.4046 0.1834 67.2247 551.9896 136.9975 2.5561 291.8667 54.3037 23.3316 208.9995 67.4789 57.1027 31.1015 33.6638 112.6481 78.7887 70.2854 20.3033 0.8033 683.2998 47.4605 17.2361 0.4974 159.0995 9.3144 92.9929 15.7054 6.0942 11.7971 479.4479 170.2269 93.0317 135.1644 221.0252 112.0371 23.3851 31.8769 22.8506 44.3905 22.1985 29.2714 25.2692 53.6975 3.0279 29.5385 1.4853 16.0656 15.2406 5.8049 7.9969 6.5044 41.3695 20.4961
temp: 298.150 k
press: 1.00000 atm
elementType: 8 8 8 7 7 7 6 6 6 6 6 6 6 6 6 6 6 6 6 1 1 1 1 1 1 1 1 1 1 1 1 1 1 1 1 1 1 1
symmnumber: 1
zpe: 812271.0 jmol-1
zpe.correction: 0.309378 hartree
zpe.thermalcorrener: 0.329981 hartree
zpe.thermalcorrenthalpy: 0.330926 hartree
zpe.thermalcorrgfe: 0.258231 hartree
zpe.sumelectzpe: -895.312120 hartree
zpe.sumelectthermal: -895.291516 hartree
zpe.sumelectthermalent: -895.290572 hartree
zpe.sumelectthermalfe: -895.363267 hartree
dipole: -3.7758 -2.8763 -0.1186
dipole: 4.7481
quadrupole: -96.4885 -100.7281 -117.5239
quadrupole: -20.5955 0.0780 0.0949
quadrupole: 8.4250 4.1854 -12.6104 -20.5955 0.0780 0.0949
hfenergy: -895.6214975 hartree
pointgroup: C01 [X(C13H19N3O3)]
dipole: -1.4565576 1.1090803 -0.37137 debye
polarizability: 265.4295962|8.7851182|177.7937445|-5.8605765|-31.3114021|112.5313107 unknown
InChI: InChI=1S/C13H19N3O3/c1-13(2,3)16-12(18)19-10-7-5-6-9(8-10)15-11(17)14-4/h5-8,14-16H,1-4H3
charge 0 multiplicity 1
38 atoms
O  -1.675179 -1.038161 0.492755
O  -1.81069 1.163492 -0.433523
O  5.057586 -0.452233 0.159953
N  -3.697673 -0.112559 0.167551
N  2.938718 0.538627 -0.202105
N  4.899165 1.72138 -0.688036
C  -4.781421 0.849058 -0.207636
C  -6.11619 0.146021 0.136652
C  -4.635045 2.154782 0.616642
C  -4.711143 1.153805 -1.726813
C  -2.356143 0.12636 0.023135
C  -0.259153 -1.188653 0.53038
C  2.059699 -0.494437 0.222464
C  0.668839 -0.20936 0.124542
C  0.162526 -2.442397 1.028693
C  2.507119 -1.746302 0.719369
C  1.545162 -2.701091 1.114833
C  4.345803 0.528035 -0.214534
C  6.350809 1.89858 -0.77711
H  -6.177887 -0.087879 1.21609
H  -6.962828 0.806824 -0.115213
H  -6.233959 -0.791225 -0.43902
H  -3.666345 2.637761 0.406797
H  -4.69649 1.94155 1.699099
H  -5.444178 2.859315 0.352294
H  -4.832858 0.2272 -2.316303
H  -5.516554 1.856015 -2.008096
H  -3.74107 1.610699 -1.983621
H  -3.957747 -1.019109 0.560149
H  0.311678 0.748866 -0.259954
H  -0.585325 -3.178939 1.334474
H  3.57706 -1.947289 0.785228
H  1.885018 -3.669058 1.499128
H  2.471588 1.38388 -0.537155
H  4.297161 2.494389 -0.972724
H  6.700549 2.723711 -0.12835
H  6.671935 2.097017 -1.816927
H  6.816265 0.960025 -0.435908
