program: Gaussian 09
title: 000010822
version: EM64L-G09RevD.01
frameworkgroup: C1[X(C7H9N)]
method: RPBEPBE
basis: SDD
operation: Freq
keyword: #p
keyword: freq=noraman
keyword: PBEPBE/SDD
title: #p freq=noraman PBEPBE/SDD
converged: YES YES NO YES
title: Mulliken charges:
elementType: N C C C C C C C H H H H H H H H H
charge: -0.010054 -0.519398 0.500922 -0.668461 -0.345481 -0.345464 -0.325003 -0.325007 0.213791 0.213794 0.224615 0.221525 0.224617 0.232679 0.232679 0.237123 0.237122
chargesum: 0.00000
title: Mulliken charges with hydrogens summed into heavy atoms:
elementType: N C C C C C C C
charge: -0.010054 -0.091813 0.500922 0.002296 -0.112802 -0.112785 -0.087880 -0.087885
polarizability: 9.75757435e+01 1.87743134e-04 8.43668102e+01 -6.12188579e+00 -1.00791428e-03 4.66526871e+01
1716.lowfreq: -5.6027 -0.0010 -0.0006 -0.0005 15.2918 25.1140 49.5833 132.6776 215.4263
frequency: 47.4143 132.6542 215.4153 300.7980 347.0498 369.3866 492.1121 568.6039 663.3122 752.2335 769.0524 790.7327 825.2088 886.5274 960.6639 962.8971 974.9964 975.1200 1038.5054 1061.6790 1063.7602 1100.9928 1218.2363 1228.3018 1240.7898 1312.8602 1316.1771 1337.3424 1394.3065 1404.4409 1465.1910 1474.0208 1476.6507 1490.4124 1557.7971 1589.2106 2983.0231 2992.4266 3044.7625 3082.8851 3087.1759 3121.5289 3122.1343 3142.7290 3149.5881
redmass: 2.4479 3.8504 1.1123 3.9679 2.0320 2.4663 4.6037 3.0582 6.9084 3.4953 3.4080 1.1626 1.4140 1.2484 5.2416 1.4317 1.4937 2.3545 1.5742 2.0583 2.1551 1.3755 1.3564 2.1221 1.3244 5.8227 1.5202 1.2676 1.1948 2.0342 1.8524 1.0416 1.1008 1.0986 6.6885 5.6916 1.0349 1.0600 1.1020 1.1002 1.1014 1.0861 1.0886 1.0961 1.0994
irintensity: 0.0715 0.1820 0.0486 1.5145 0.0711 0.0001 8.3575 19.3389 0.3604 0.8968 11.5030 3.4037 52.5835 0.0018 3.7354 0.1833 0.0007 0.8927 1.0116 0.2416 18.0448 0.1975 1.6425 4.1143 0.3687 2.0740 1.4172 0.9588 8.8718 17.1050 4.2078 15.2012 4.3795 12.6235 11.6070 53.2135 34.1348 30.8690 7.1699 48.3213 40.0573 3.2295 13.4557 63.9222 0.1046
temp: 298.150 k
press: 1.00000 atm
elementType: 7 6 6 6 6 6 6 6 1 1 1 1 1 1 1 1 1
symmnumber: 1
zpe: 374019.1 jmol-1
zpe.correction: 0.142456 hartree
zpe.thermalcorrener: 0.149791 hartree
zpe.thermalcorrenthalpy: 0.150735 hartree
zpe.thermalcorrgfe: 0.110300 hartree
zpe.sumelectzpe: -326.296690 hartree
zpe.sumelectthermal: -326.289355 hartree
zpe.sumelectthermalent: -326.288411 hartree
zpe.sumelectthermalfe: -326.328846 hartree
dipole: 3.2317 -0.0001 -0.5105
dipole: 3.2718
quadrupole: -54.0643 -41.5497 -50.7789
quadrupole: 0.0005 0.1402 -0.0005
quadrupole: -5.2667 7.2479 -1.9812 0.0005 0.1402 -0.0005
hfenergy: -326.4391461 hartree
pointgroup: C01 [X(C7H9N1)]
dipole: -1.2722365 0.0000787 -0.1958513 debye
dipolederiv: -0.3921601 -0.0000019 -0.0123409 0.0000036 -0.3939063 -0.0000104 -0.0307506 -0.0000096 -0.2561423 -0.0759522 -0.000009 0.0401105 -0.0000617 0.1535631 0.0000075 0.1667899 0.0000079 0.0886984 0.4812353 -0.0000089 0.0294218 -0.0000139 0.0996818 0.0000201 0.0654112 0.0000159 -0.0534933 0.0014127 -0.0000057 0.0362631 0.0000207 0.0759484 0.0000172 -0.0817437 0.0000194 0.0137237 -0.3160452 -0.1723638 -0.0081992 -0.1380871 -0.0219956 -0.0195701 -0.0377516 -0.0297549 -0.1199145 -0.3160069 0.1723911 -0.0081734 0.1381323 -0.0220406 0.0195819 -0.0377254 0.0297696 -0.1199083 0.244752 0.175422 0.0555298 0.0350567 0.2837683 0.0008333 0.068098 0.0360075 -0.0627457 0.2447273 -0.175421 0.0555017 -0.0350634 0.2838003 -0.0007838 0.0680863 -0.0359572 -0.0627583 0.0158744 0.0092252 -0.0123262 0.0586861 -0.069056 0.1390502 -0.0350682 0.0845456 -0.0109302 0.0158579 -0.0092331 -0.0123534 -0.0586619 -0.0689418 -0.1390726 -0.0351082 -0.0845662 -0.0110285 0.0894793 0.0697148 -0.0277702 0.0273041 -0.0677778 0.1241404 -0.0022206 0.0814129 -0.003417 -0.2411709 0.0000171 -0.0158317 0.000016 0.1079928 0.0000122 -0.0095602 0.0000114 0.0610597 0.0894744 -0.0697103 -0.0278122 -0.0273081 -0.0676694 -0.1241698 -0.0022341 -0.0814455 -0.0035181 0.0436664 0.1120829 -0.0288548 0.0817105 -0.0571597 0.0148792 -0.027336 0.0222664 0.1392995 0.043646 -0.1120876 -0.028872 -0.0817228 -0.0571316 -0.0149036 -0.0273502 -0.0222883 0.1392914 0.0355947 -0.0944854 -0.0171546 -0.0800743 -0.0895244 -0.0135109 -0.0207762 -0.0190972 0.1308889 0.0356149 0.0944733 -0.0171385 0.080063 -0.0895515 0.0134791 -0.0207602 0.0190622 0.1308945 unknown
polarizability: 97.6228941|-0.0001849|84.3668101|5.9223482|0.0020894|46.6055366 unknown
InChI: InChI=1S/C7H9N/c1-2-7-3-5-8-6-4-7/h3-6H,2H2,1H3
charge 0 multiplicity 1
17 atoms
N  2.239497 -0.000132 0.26245
C  -2.071393 0.00019 -0.585494
C  -0.574997 0.000083 -0.320425
C  -2.895492 -0.000097 0.730605
C  0.151994 1.208871 -0.169332
C  0.151845 -1.208816 -0.169505
C  1.534988 1.162454 0.116833
C  1.534844 -1.162609 0.116666
H  -2.345683 0.889906 -1.183535
H  -2.34574 -0.889226 -1.183957
H  -2.665936 -0.892479 1.34036
H  -3.978979 0.000001 0.513117
H  -2.665859 0.891969 1.340792
H  -0.350073 2.177348 -0.2787
H  -0.350336 -2.177218 -0.279014
H  2.113987 2.08615 0.232578
H  2.113733 -2.086394 0.232262
