program: Gaussian 09
title: 000099390
version: EM64L-G09RevD.01
frameworkgroup: C1[X(C4H6N2O2S)]
method: RPBEPBE
basis: SDD
operation: Freq
keyword: #p
keyword: freq=noraman
keyword: PBEPBE/SDD
title: #p freq=noraman PBEPBE/SDD
converged: YES YES NO NO
title: Mulliken charges:
elementType: S O O N N C C C C H H H H H H
charge: 0.946747 -0.580794 -0.519890 -0.322601 -0.014703 -0.075971 -0.720321 -0.177503 -0.290594 0.291344 0.268241 0.288020 0.367003 0.274738 0.266284
chargesum: 0.00000
title: Mulliken charges with hydrogens summed into heavy atoms:
elementType: S O O N N C C C C
charge: 0.946747 -0.580794 -0.519890 0.044402 -0.014703 -0.075971 0.127283 0.097235 -0.024310
polarizability: 1.09076080e+02 -3.43625863e+00 8.31069316e+01 8.36633813e-01 -2.88872388e+00 6.04857185e+01
1716.lowfreq: -5.3986 -0.0016 0.0004 0.0012 1.4002 7.1422 60.3120 101.7390 126.6269
frequency: 60.3004 101.7368 126.6232 154.1178 225.2415 227.5010 260.5729 334.0821 356.0485 420.8391 581.7100 620.4535 653.4870 757.1166 767.0229 778.6613 856.6687 880.3728 888.5204 932.3548 978.6249 1014.4731 1062.2748 1078.4031 1146.0584 1192.0631 1303.1399 1315.5827 1367.9637 1407.1256 1413.7610 1417.7957 1469.2986 3031.6737 3183.8231 3187.4241 3237.6876 3265.5046 3535.2647
redmass: 5.0866 4.2701 2.5973 1.3473 4.6607 4.7589 8.7259 8.1101 7.3431 8.7767 8.7927 3.4500 8.1233 1.1458 1.2108 12.5436 1.3726 6.3294 3.5958 4.3986 1.3459 1.7206 1.6054 1.5944 2.5174 3.0480 1.1786 2.3121 3.5864 1.3030 2.5447 1.0775 3.0927 1.0243 1.1079 1.1080 1.0927 1.1085 1.0826
irintensity: 10.8135 6.9994 6.9707 3.2662 0.2601 6.7432 1.4318 21.5861 13.3480 66.4543 52.8587 1.8831 3.5854 177.2814 2.7577 69.1005 10.6266 11.7140 40.3570 5.9776 40.6973 78.4761 41.9213 16.0727 2.1028 28.3725 4.3638 3.6822 12.1555 5.0275 20.8310 12.2945 27.1853 0.4833 0.2757 0.4565 3.3466 0.6593 97.0233
temp: 298.150 k
press: 1.00000 atm
elementType: 16 8 8 7 7 6 6 6 6 1 1 1 1 1 1
symmnumber: 1
zpe: 272697.0 jmol-1
zpe.correction: 0.103865 hartree
zpe.thermalcorrener: 0.113268 hartree
zpe.thermalcorrenthalpy: 0.114213 hartree
zpe.thermalcorrgfe: 0.068832 hartree
zpe.sumelectzpe: -813.163373 hartree
zpe.sumelectthermal: -813.153969 hartree
zpe.sumelectthermalent: -813.153025 hartree
zpe.sumelectthermalfe: -813.198406 hartree
dipole: -3.4056 0.1831 -3.7898
dipole: 5.0984
quadrupole: -52.8772 -62.1428 -64.5887
quadrupole: -9.9523 -6.6712 3.7239
quadrupole: 6.9923 -2.2732 -4.7191 -9.9523 -6.6712 3.7239
hfenergy: -813.2672376 hartree
pointgroup: C01 [X(C4H6N2O2S1)]
dipole: 1.3879618 1.1031543 0.9381812 debye
dipolederiv: 1.9103241 0.0207908 -0.0041047 -0.0316639 1.2755684 0.0611927 0.0050325 0.0679579 1.3187451 -0.6724291 -0.0310368 0.0363845 0.0928561 -0.6560935 0.134122 -0.0124771 0.0273679 -0.5991519 -0.6752223 -0.0376134 -0.0167946 -0.1135155 -0.6095941 -0.1145705 0.005447 -0.0274029 -0.5314299 -0.2316922 0.1147646 -0.1050807 0.1969603 -0.3720201 0.1744807 -0.2108288 0.1998388 -0.3561179 -0.3930183 0.0753413 -0.052011 0.0329721 -0.3226677 0.1278895 -0.0653509 0.134971 -0.3082819 -0.1700639 -0.0314758 0.0160441 -0.0339746 0.0519813 -0.2424623 0.086056 -0.2397617 0.0250255 -0.1780241 -0.0032568 -0.0244237 0.004006 -0.1128011 -0.0043311 0.0289752 -0.0124016 -0.231725 -0.1348746 -0.1103655 0.12286 0.0086427 0.0175045 -0.1541038 -0.0217327 -0.1507877 -0.0017292 0.0181963 -0.0304465 0.0412593 -0.1557017 -0.014333 -0.1253177 0.1459752 -0.1334596 -0.0478879 0.1107163 0.0383562 0.0076679 0.0499058 0.0354773 0.0146588 -0.0031386 0.0295836 0.0239153 0.0762488 -0.0527895 0.0179234 -0.0707992 0.0106267 -0.0305624 0.0062867 -0.04252 0.0190344 -0.0161746 0.0117737 -0.0020272 0.0130123 0.1212594 -0.0152819 0.0329987 -0.013594 0.0696349 0.311169 0.0313503 -0.0362377 -0.0117183 0.3035357 0.0311173 -0.0045985 0.0184847 0.3233682 0.0513844 -0.0306983 0.0289507 -0.0357156 0.1408115 0.0841947 0.0469566 0.0830891 0.156794 -0.0065398 0.0353058 -0.0304104 0.0547337 0.1307446 0.0589741 -0.0396012 0.0586344 0.1398063 unknown
polarizability: 109.2192757|1.5016877|73.347813|-2.6405766|-11.4702475|70.1016413 unknown
InChI: InChI=1S/C4H6N2O2S/c1-9(7,8)4-5-2-3-6-4/h2-3,5H,1H3
charge 0 multiplicity 1
15 atoms
S  -1.484625 0.251771 -0.149184
O  -1.603081 1.650409 -1.014489
O  -2.145805 -1.132695 -0.690431
N  1.176483 0.931708 -0.695253
N  1.048252 -0.74297 0.834356
C  0.366637 0.106869 0.062916
C  -2.099533 0.539649 1.63687
C  2.491205 0.586049 -0.380295
C  2.395843 -0.446546 0.566094
H  -1.777226 -0.337776 2.214061
H  -1.636214 1.473398 1.982304
H  -3.192558 0.614907 1.553366
H  0.818103 1.651377 -1.329945
H  3.349271 1.076973 -0.830127
H  3.197646 -0.986724 1.062755
