program: Gaussian 09
title: 000099404
version: EM64L-G09RevD.01
frameworkgroup: C1[X(C13H25OP)]
method: RPBEPBE
basis: SDD
operation: Freq
keyword: #p
keyword: freq=noraman
keyword: PBEPBE/SDD
title: #p freq=noraman PBEPBE/SDD
converged: YES YES NO NO
title: Mulliken charges:
elementType: P O C C C C C C C C C C C C C H H H H H H H H H H H H H H H H H H H H H H H H H
charge: 0.704389 -0.532039 -0.513446 -0.486392 -0.404421 -0.409977 -0.411854 -0.415383 -0.437256 -0.425508 -0.431032 -0.424503 0.050270 -0.676805 -0.679807 0.254987 0.295671 0.264526 0.203989 0.224215 0.221272 0.205095 0.227939 0.222946 0.215530 0.213689 0.209446 0.198341 0.215596 0.218601 0.202154 0.215177 0.209563 0.182991 0.203833 0.229285 0.213034 0.196952 0.228899 0.220031
chargesum: 0.00000
title: Mulliken charges with hydrogens summed into heavy atoms:
elementType: P O C C C C C C C C C C C C C
charge: 0.704389 -0.532039 -0.258459 -0.190721 0.064094 0.035510 0.021180 0.023093 -0.014121 -0.011571 -0.010278 0.000237 0.233261 -0.030652 -0.033924
polarizability: 1.89476742e+02 -3.67792268e-01 1.74003140e+02 2.03924480e+00 8.92364899e-01 1.34513617e+02
1716.lowfreq: -19.3023 -6.1354 0.0004 0.0006 0.0011 4.9721 13.8818 26.7355 33.8697
frequency: -16.8109 25.6593 32.8751 38.7319 52.4415 66.7206 83.8805 107.4791 131.9345 194.7317 203.8642 214.0261 217.7928 232.8628 256.0176 262.7590 318.4609 340.1299 400.3957 425.7192 439.6287 468.3268 516.3297 583.9929 588.6678 632.3402 714.5961 722.5489 787.5407 799.4680 821.5197 848.4922 851.2081 889.8983 892.4924 902.0242 908.1997 915.5334 919.1557 926.7283 933.7393 937.3094 947.8376 954.1602 993.5421 1007.0262 1052.1168 1054.0601 1073.7881 1089.5573 1102.3342 1116.6756 1134.0519 1146.8232 1155.9965 1166.3775 1174.0536 1193.5381 1201.2597 1222.4582 1232.8131 1238.1436 1253.9762 1262.8156 1270.0753 1288.0792 1288.5539 1298.5560 1301.1211 1302.3715 1305.5932 1310.9664 1312.9349 1320.8078 1327.8340 1370.9627 1385.8904 1452.0939 1462.0374 1464.3628 1465.2035 1466.4049 1466.7363 1467.9690 1470.2560 1473.2043 1484.2296 1486.1375 1487.2171 2946.7117 2967.6569 2972.1867 2974.0032 2984.1696 2985.9443 2986.3678 2988.1009 2990.1330 2995.4936 3001.5847 3009.4636 3014.6083 3044.4484 3045.3370 3052.1209 3055.9067 3057.8072 3064.3924 3071.7263 3075.7395 3079.2759 3080.1212 3086.6235 3096.0414
redmass: 2.1932 2.6079 2.6481 3.2659 2.7782 2.9675 3.0158 2.9592 3.4983 2.0972 1.1421 1.8898 2.2263 2.5908 3.0375 1.4133 2.9925 2.9864 3.2332 2.9849 4.4056 2.3939 2.2875 2.2909 2.4169 4.9565 2.3857 3.0083 1.3301 1.6053 3.4044 1.9229 1.9291 2.7645 2.8356 2.1260 2.1531 1.2142 2.7050 2.1151 1.3785 2.0331 1.6397 1.7211 1.3156 1.3703 1.9038 2.1271 3.7113 4.1631 1.6228 1.3434 1.3238 1.9574 1.5195 1.5139 1.9789 1.4736 1.4224 1.3792 1.2901 1.2762 1.1694 1.3142 1.2677 1.1688 1.1736 1.2834 1.2392 1.3579 1.3128 1.3517 1.3530 1.3581 1.4434 1.2613 1.2279 1.0496 1.0844 1.0520 1.0839 1.0776 1.0537 1.0785 1.0862 1.0858 1.0522 1.0962 1.0957 1.0847 1.0675 1.0793 1.0351 1.0625 1.0608 1.0355 1.0611 1.0614 1.0612 1.0655 1.0670 1.0823 1.0982 1.0985 1.0983 1.1021 1.1023 1.1046 1.0991 1.1036 1.1009 1.1047 1.0992 1.1001
irintensity: 0.0352 0.0544 0.0193 0.3319 0.6032 0.0765 0.3885 1.1113 2.8499 0.7165 0.0453 0.4868 1.0485 0.1225 0.0981 0.8862 0.1706 0.0601 5.3413 3.7063 5.7169 5.9940 12.8690 4.6549 1.1892 25.7104 5.7330 5.2868 2.9249 2.4970 54.8676 2.5734 5.3812 0.2726 0.2735 11.8900 15.0974 1.8823 50.3469 26.1153 0.0690 3.3753 2.9408 2.8207 3.0019 3.1407 1.0217 1.6422 1.3117 2.6316 77.0180 19.6097 9.3314 11.4859 2.2069 0.9513 19.1465 0.6394 1.5246 6.6861 2.3482 2.5507 0.3849 2.3531 1.9685 0.9445 4.7298 0.7205 1.1018 3.1486 1.2124 11.0254 18.0382 8.4204 6.5009 33.5222 26.4353 5.8232 10.3503 7.2101 3.8528 1.8120 4.0354 7.5248 9.4709 8.4007 9.5317 3.9184 7.2652 40.3511 13.6931 21.3898 21.0307 21.2998 47.8423 22.7557 50.6862 24.6268 52.8214 50.3624 33.2848 12.1377 25.0159 33.9827 25.0319 22.1909 28.2051 24.5317 35.5523 87.6156 9.9687 77.0970 63.9028 36.5467
temp: 298.150 k
press: 1.00000 atm
elementType: 15 8 6 6 6 6 6 6 6 6 6 6 6 6 6 1 1 1 1 1 1 1 1 1 1 1 1 1 1 1 1 1 1 1 1 1 1 1 1 1
symmnumber: 1
zpe: 931503.3 jmol-1
zpe.correction: 0.354791 hartree
zpe.thermalcorrener: 0.372033 hartree
zpe.thermalcorrenthalpy: 0.372977 hartree
zpe.thermalcorrgfe: 0.307808 hartree
zpe.sumelectzpe: -925.608269 hartree
zpe.sumelectthermal: -925.591027 hartree
zpe.sumelectthermalent: -925.590083 hartree
zpe.sumelectthermalfe: -925.655251 hartree
dipole: 0.4141 -0.1617 -0.1559
dipole: 0.4711
quadrupole: -99.3555 -96.6262 -103.7662
quadrupole: -1.2864 0.7395 -0.3503
quadrupole: 0.5605 3.2897 -3.8502 -1.2864 0.7395 -0.3503
hfenergy: -925.9630595 hartree
pointgroup: C01 [X(C13H25O1P1)]
dipole: 0.1314959 0.1218216 0.0470966 debye
polarizability: 186.2751269|5.4709098|176.410858|-6.7236123|-1.5825768|135.3075142 unknown
InChI: InChI=1S/C13H25OP/c1-11(2)14-15(12-7-3-4-8-12)13-9-5-6-10-13/h11-13H,3-10H2,1-2H3
charge 0 multiplicity 1
40 atoms
P  0.334125 -0.082451 0.813657
O  0.010593 -1.456826 -0.32051
C  -1.288872 0.882781 0.493804
C  1.519319 0.884956 -0.332295
C  -1.757211 0.971004 -0.993445
C  -2.503231 0.287582 1.254251
C  1.792793 2.330434 0.171878
C  2.928525 0.209814 -0.432665
C  -3.324545 0.942054 -0.950923
C  -3.710407 0.960571 0.557357
C  3.163561 2.675936 -0.462099
C  3.977346 1.36401 -0.300156
C  0.313217 -2.826733 0.171916
C  -0.742246 -3.295304 1.18934
C  0.357048 -3.70091 -1.088595
H  -1.091044 1.90077 0.890384
H  1.051939 0.92031 -1.333966
H  -1.372043 0.105067 -1.559627
H  -1.37657 1.889106 -1.476374
H  -2.461749 0.477036 2.34206
H  -2.543359 -0.80825 1.098377
H  1.882753 2.348243 1.278031
H  0.993107 3.038434 -0.111391
H  3.02603 -0.325229 -1.393417
H  3.073998 -0.541301 0.3676
H  -3.696543 0.013058 -1.421618
H  -3.773839 1.788406 -1.501131
H  -3.811689 2.003688 0.916203
H  -4.667255 0.445616 0.758824
H  3.651899 3.545624 0.013804
H  3.027075 2.912721 -1.535434
H  4.79118 1.278824 -1.042286
H  4.444967 1.339339 0.702386
H  1.312789 -2.823253 0.658954
H  -0.514193 -4.317543 1.545781
H  -0.766664 -2.621645 2.065515
H  -1.744586 -3.30234 0.723367
H  0.590562 -4.749875 -0.827935
H  1.124006 -3.328855 -1.789279
H  -0.621384 -3.67457 -1.600742
