program: Gaussian 09
title: 000099397
version: EM64L-G09RevD.01
frameworkgroup: C1[X(C9H12N3PS)]
method: RPBEPBE
basis: SDD
operation: Freq
keyword: #p
keyword: freq=noraman
keyword: PBEPBE/SDD
title: #p freq=noraman PBEPBE/SDD
converged: NO YES NO NO
title: Mulliken charges:
elementType: S P N N N C C C C C C C C C H H H H H H H H H H H H
charge: -0.276503 0.424192 -0.001678 -0.001580 -0.001675 -0.639940 -0.640616 -0.641641 -0.376454 -0.376193 -0.376358 -0.139892 -0.140077 -0.140276 0.286873 0.271776 0.286172 0.272343 0.285731 0.272835 0.256593 0.293884 0.256822 0.294235 0.257445 0.293982
chargesum: 0.00000
title: Mulliken charges with hydrogens summed into heavy atoms:
elementType: S P N N N C C C C C C C C C
charge: -0.276503 0.424192 -0.001678 -0.001580 -0.001675 -0.081291 -0.082100 -0.083075 0.174024 0.174863 0.175069 -0.139892 -0.140077 -0.140276
polarizability: 1.62263307e+02 2.38519890e-01 1.61214118e+02 2.55690795e-01 -7.05885910e-02 1.30562410e+02
1716.lowfreq: -9.4017 -4.2044 -0.0022 -0.0018 -0.0017 6.4148 25.1896 28.3124 40.0870
frequency: 25.1129 27.9869 40.0356 50.8656 63.7874 73.5372 99.3463 101.6470 112.8672 166.8497 168.1859 184.9649 196.2164 202.4878 248.6114 357.5901 358.9392 368.7008 371.9349 372.4950 437.6916 493.0545 494.1979 527.2723 694.9870 705.5276 706.6178 757.8788 760.1149 760.8562 920.6396 927.7452 927.9086 966.4363 968.1171 970.5520 1033.8302 1035.1258 1037.0258 1138.6939 1142.4670 1150.9785 1232.4063 1233.2763 1236.5437 1277.9035 1279.8741 1280.7155 1328.9128 1329.4161 1332.3463 1424.0751 1431.4287 1433.6995 1450.3997 1451.4124 1451.9860 2201.9227 2202.0568 2202.2358 2982.9041 2984.1975 2985.3816 3015.1872 3015.5242 3017.1280 3043.5838 3044.1554 3045.1481 3090.5134 3091.2877 3092.2295
redmass: 8.9235 10.1781 7.1217 2.9339 2.8225 2.8675 4.6276 5.3518 3.5608 7.6055 7.7736 7.0812 2.9636 2.8618 4.1712 6.3457 6.1362 3.6654 3.6148 3.6267 8.4416 8.2701 8.3103 7.1522 2.8494 2.7984 2.6718 1.6028 1.5355 1.5729 3.4218 4.3308 4.2618 1.7531 1.7667 1.9529 3.7221 3.7475 3.7197 1.1420 1.1452 1.1403 1.2177 1.2170 1.2149 1.1128 1.1134 1.1101 1.3755 1.3762 1.3847 1.0733 1.0765 1.0751 1.0832 1.0808 1.0833 12.4228 12.4229 12.4288 1.0611 1.0613 1.0612 1.0580 1.0579 1.0577 1.0992 1.0990 1.0989 1.1052 1.1051 1.1052
irintensity: 2.6462 3.2285 12.0351 2.8894 3.2122 2.5304 14.9533 16.6857 3.7652 0.1317 0.1030 0.6696 3.2588 3.2447 0.4769 1.8311 1.9796 0.2989 0.4171 0.3471 3.5924 14.1180 14.6203 14.9493 4.1337 0.2507 0.1615 33.0748 18.9378 18.0207 0.7479 0.6951 0.7165 12.1268 12.1204 16.2846 10.3943 9.8547 6.5878 5.6317 5.5605 5.0833 13.5017 13.4983 4.1773 8.4255 10.7520 9.4589 7.9497 8.1201 0.8057 3.8201 3.5793 3.0199 26.0606 13.7627 17.4544 17.7922 19.0748 3.3716 17.1464 14.2001 9.2755 4.1017 5.7432 9.8523 8.1063 7.2355 7.5474 3.7463 5.2588 5.4641
temp: 298.150 k
press: 1.00000 atm
elementType: 16 15 7 7 7 6 6 6 6 6 6 6 6 6 1 1 1 1 1 1 1 1 1 1 1 1
symmnumber: 1
zpe: 510433.0 jmol-1
zpe.correction: 0.194414 hartree
zpe.thermalcorrener: 0.211744 hartree
zpe.thermalcorrenthalpy: 0.212688 hartree
zpe.thermalcorrgfe: 0.145698 hartree
zpe.sumelectzpe: -1252.609156 hartree
zpe.sumelectthermal: -1252.591826 hartree
zpe.sumelectthermalent: -1252.590881 hartree
zpe.sumelectthermalfe: -1252.657872 hartree
dipole: 0.0252 -0.0741 -1.3165
dipole: 1.3189
quadrupole: -136.6742 -135.7192 -104.3245
quadrupole: -0.2485 -0.2535 0.0576
quadrupole: -11.1015 -10.1466 21.2481 -0.2485 -0.2535 0.0576
hfenergy: -1252.8035696 hartree
pointgroup: C01 [X(C9H12N3P1S1)]
dipole: 0.0212043 0.0136199 -0.5182697 debye
dipolederiv: -0.5777427 0.0003131 -0.00059 -0.0026864 -0.5813153 -0.0006644 -0.000334 0.0005584 -0.6087037 0.9334004 -0.0377115 0.0022117 0.0362455 0.9350528 0.0008259 0.0028727 0.0011248 1.2173315 -0.2133028 0.0453122 -0.0011185 -0.0235631 -0.3522883 0.0076524 0.0085734 0.0521037 -0.2216526 -0.3238467 0.0880651 0.0066271 0.0235384 -0.2415471 -0.0029301 0.0431861 -0.0362004 -0.2217172 -0.3099343 -0.0323355 -0.0045549 -0.0978882 -0.2571977 -0.0028449 -0.0497898 -0.0188803 -0.2207824 -0.182257 0.0199359 -0.0024545 -0.0079428 -0.1218401 0.0048643 -0.0797202 0.0800511 -0.186807 -0.1394111 -0.0145444 0.0051692 -0.0364098 -0.1616039 0.0003956 0.1097201 0.0298067 -0.1907117 -0.1332336 0.0313008 -0.0036404 0.0073858 -0.1665913 -0.0054597 -0.0315847 -0.1118381 -0.1880395 0.1902828 0.0783871 -0.0367276 -0.0071115 -0.0556355 0.0223804 -0.0140058 0.235107 0.0835523 -0.0129178 0.1300922 0.0353036 0.0544395 0.1532698 0.015434 0.2078395 -0.1094157 0.0816277 0.0328682 -0.0834237 -0.0017768 -0.1586118 0.1013688 -0.0356809 -0.1956722 -0.1263574 0.0860805 -0.0530156 -0.1373313 0.0092944 -0.049839 0.1940442 -0.0825572 0.0019827 -0.1431145 -0.0166358 0.202022 -0.1064413 -0.0784216 -0.0250063 -0.0649859 0.0373126 -0.1303564 0.0766754 -0.0134439 0.0584756 0.110112 0.068861 0.1926374 0.0852633 0.0466719 0.1268119 0.0732781 -0.0184601 -0.0605394 -0.0020283 -0.0201608 0.063913 0.0441641 -0.0045042 -0.0065798 0.0036165 0.071049 0.0763192 -0.0040451 0.0345152 -0.0121625 0.0134623 0.0398595 0.0372523 -0.0262491 -0.0773119 -0.0106906 -0.0950391 0.0099635 -0.0288075 -0.0066858 0.0226383 0.0070147 0.0069656 0.0705636 0.0368229 0.0346279 0.0147229 0.0252101 0.051947 -0.0533768 -0.0435077 -0.0227065 -0.0750702 0.0447062 -0.0026328 0.0154594 0.0627484 -0.0629998 -0.0204676 0.0037289 -0.0097529 0.069486 0.021752 -0.0158199 -0.0546716 -0.0258316 0.0651173 0.0143839 0.0002736 0.0495756 -0.0737433 -0.0436919 0.01857 -0.0028612 0.0378141 0.0506064 0.0050771 0.0219977 -0.0046533 0.1042039 0.0985244 0.0283247 0.0292191 0.018151 0.180746 0.0123457 0.0108979 -0.1161284 0.0398433 0.0011804 -0.0643867 0.011376 -0.0469879 0.0070332 0.0034233 -0.0107178 -0.012416 0.1039683 0.1355306 -0.038619 -0.0046282 -0.0527622 0.1368224 -0.0337217 -0.103424 0.0439841 0.0411875 0.0519157 0.0179908 -0.0015421 0.0351457 -0.0438162 -0.0109993 -0.0042999 0.0162286 0.1043837 0.176783 0.0313271 -0.0295752 0.0183815 0.0976092 0.0199421 0.0878408 0.068637 0.0398023 unknown
polarizability: 161.3171698|-0.3940968|162.1577951|-0.3223256|0.2080314|130.5648706 unknown
InChI: InChI=1S/C9H12N3PS/c10-4-1-7-13(14,8-2-5-11)9-3-6-12/h1-3,7-9H2
charge 0 multiplicity 1
26 atoms
S  0.027673 0.017133 2.45211
P  0.005786 0.0066 0.344363
N  -0.079202 5.258521 -0.460207
N  4.54526 -2.621638 -0.504489
N  -4.51792 -2.683808 -0.395628
C  -0.228152 1.731296 -0.410252
C  1.605141 -0.672959 -0.416231
C  -1.386485 -1.05318 -0.389268
C  0.530497 2.811246 0.401994
C  2.163993 -1.855109 0.415337
C  -2.674471 -0.963211 0.467739
C  0.197725 4.164701 -0.072291
C  3.478333 -2.283669 -0.090948
C  -3.696301 -1.910265 -0.008076
H  -1.312083 1.942058 -0.402552
H  0.111959 1.699581 -1.461225
H  2.334658 0.155639 -0.435478
H  1.392684 -0.973176 -1.458323
H  -1.021935 -2.095136 -0.419333
H  -1.564378 -0.718356 -1.427339
H  1.625321 2.668614 0.328816
H  0.270728 2.713589 1.475334
H  1.473641 -2.719463 0.39245
H  2.249055 -1.549371 1.477382
H  -3.097601 0.058834 0.444642
H  -2.426625 -1.175469 1.527172
