program: Gaussian 09
title: 000099408
version: EM64L-G09RevD.01
frameworkgroup: C1[X(C13H27OP)]
method: RPBEPBE
basis: SDD
operation: Freq
keyword: #p
keyword: freq=noraman
keyword: PBEPBE/SDD
title: #p freq=noraman PBEPBE/SDD
converged: YES YES NO NO
title: Mulliken charges:
elementType: P O C C C C C C C C C C C C C H H H H H H H H H H H H H H H H H H H H H H H H H H H
charge: 1.039115 -0.687870 -0.481428 -0.421629 -0.401898 -0.420530 -0.435818 -0.706048 -0.732925 -0.012465 -0.006787 -0.703617 -0.695357 -0.706179 -0.697833 0.268962 0.234158 0.241998 0.227833 0.219301 0.213139 0.219246 0.207170 0.223921 0.236031 0.246246 0.244801 0.243887 0.202596 0.209130 0.202154 0.187434 0.294522 0.207537 0.205823 0.219890 0.293800 0.184030 0.204297 0.220537 0.207240 0.205587
chargesum: 0.00000
title: Mulliken charges with hydrogens summed into heavy atoms:
elementType: P O C C C C C C C C C C C C C
charge: 1.039115 -0.687870 -0.212466 0.054527 0.045236 0.011855 -0.004726 -0.223771 -0.244236 0.190130 0.202343 -0.019507 -0.062108 -0.024051 -0.064470
polarizability: 1.76695754e+02 2.37453683e-01 1.73610859e+02 -2.32741678e-01 2.93454976e+00 1.48364566e+02
1716.lowfreq: -15.6992 -0.0021 -0.0020 -0.0019 6.3201 8.5675 15.2796 16.2359 38.9696
frequency: -8.0903 15.8425 37.8407 49.7639 54.3234 76.8903 95.2461 144.8941 165.2341 175.4807 196.0750 201.0791 208.0658 220.7534 227.6465 238.5171 250.6755 284.3784 288.5709 333.5785 344.5285 371.4066 401.7827 411.2969 427.7598 452.0704 498.1437 591.0009 659.3729 694.0087 743.7733 783.6715 807.7712 813.3768 831.3481 845.8992 855.0867 889.9692 908.6074 921.2719 923.1471 937.7837 948.9997 952.4408 956.8335 957.1348 964.3365 969.0305 1003.1896 1054.2279 1061.5387 1063.3433 1089.6463 1115.1030 1119.5436 1138.7161 1164.4833 1178.9116 1180.6622 1195.2512 1209.3193 1215.0377 1229.4413 1235.3592 1238.5043 1255.4103 1268.0657 1291.5272 1303.4053 1308.5244 1311.5181 1314.6714 1321.2154 1334.3150 1338.8608 1376.5636 1378.4109 1393.5526 1396.3664 1424.2501 1429.7028 1466.7161 1467.6001 1467.8344 1468.6572 1470.5169 1470.7769 1476.7104 1478.3595 1479.2702 1492.0686 1496.5563 1499.4655 2958.2250 2961.5190 2962.6189 2965.3022 2965.6291 2966.0606 2979.1543 2983.0137 2987.8153 2993.9006 2996.3006 2999.3645 3015.0011 3045.4717 3048.9586 3052.2958 3055.8304 3057.1658 3059.1107 3062.9075 3064.2775 3069.2486 3069.6306 3070.0645 3079.4207 3081.5229 3089.0618
redmass: 2.9581 2.6947 2.5338 2.9307 2.8871 2.4905 2.9507 3.4213 2.4631 2.7951 1.9016 1.4074 2.4794 1.1005 1.7954 1.9072 1.4124 2.1764 2.0942 3.8806 2.4909 2.3231 1.9486 1.9223 2.6684 3.8535 2.8670 2.3029 3.4744 3.6491 2.5378 1.4079 2.2093 2.4859 2.0275 1.7411 1.8552 2.8041 2.1544 1.1710 1.1666 2.3386 1.8597 1.6341 1.7073 2.7243 1.7764 1.8469 1.3289 2.0342 1.3428 1.5426 3.3164 1.9133 1.9817 1.3714 1.4582 1.7539 1.7759 1.4471 1.4274 1.4586 1.3101 1.3005 1.3023 1.2025 1.3151 1.1734 1.2695 1.3690 1.4647 1.4976 1.4373 1.3419 1.3134 1.2012 1.2036 1.2045 1.2009 1.0828 1.0818 1.0550 1.0525 1.0489 1.0806 1.0472 1.0845 1.0824 1.0501 1.0508 1.0933 1.0494 1.0482 1.0753 1.0483 1.0427 1.0364 1.0620 1.0428 1.0580 1.0588 1.0642 1.0609 1.0769 1.0668 1.0664 1.1029 1.1029 1.0981 1.0991 1.0990 1.1012 1.0993 1.0993 1.0991 1.0991 1.1033 1.1013 1.1010 1.1016
irintensity: 0.1353 0.2352 0.0891 0.0736 0.1369 0.0731 0.1379 6.3309 1.6057 4.9259 3.6172 1.8257 1.2050 0.6456 10.1500 6.3689 2.1045 0.8464 0.6867 1.8410 1.4516 3.7018 0.5101 0.2182 4.9226 31.7283 36.9054 0.8583 4.7297 19.3633 14.5899 2.3448 18.9881 17.5258 3.0488 9.2220 2.0330 0.7738 15.8823 4.3756 4.3030 19.6677 10.9726 3.4126 4.6545 27.8884 4.5981 4.8030 6.0040 0.5419 17.6733 9.1515 5.8851 13.9720 9.3982 22.9865 1.3660 20.7445 14.1421 1.4458 6.0818 1.6279 6.6538 3.4624 9.6127 2.0706 3.4876 0.9170 1.7052 1.1870 1.5897 2.1982 2.3480 4.8474 7.5711 15.5842 23.8551 33.3063 20.6410 5.3400 6.7462 2.4756 7.5310 11.4659 11.1066 5.3323 6.8851 5.3746 7.6952 3.7886 4.2386 19.7305 20.4324 8.8854 19.0064 50.5807 49.5423 35.3800 41.9190 12.4054 19.6073 25.5706 28.1788 21.7133 35.6432 36.5136 6.9396 6.2021 29.5843 16.9333 14.0073 18.3071 54.9285 79.8975 69.9412 56.4872 33.8829 6.9703 6.2380 61.5427
temp: 298.150 k
press: 1.00000 atm
elementType: 15 8 6 6 6 6 6 6 6 6 6 6 6 6 6 1 1 1 1 1 1 1 1 1 1 1 1 1 1 1 1 1 1 1 1 1 1 1 1 1 1 1
symmnumber: 1
zpe: 983562.1 jmol-1
zpe.correction: 0.374619 hartree
zpe.thermalcorrener: 0.393363 hartree
zpe.thermalcorrenthalpy: 0.394308 hartree
zpe.thermalcorrgfe: 0.326786 hartree
zpe.sumelectzpe: -926.776241 hartree
zpe.sumelectthermal: -926.757497 hartree
zpe.sumelectthermalent: -926.756553 hartree
zpe.sumelectthermalfe: -926.824074 hartree
dipole: -1.4105 -1.5219 -4.0277
dipole: 4.5308
quadrupole: -100.5645 -100.2293 -112.0515
quadrupole: 0.4984 -3.0818 -3.5370
quadrupole: 3.7173 4.0525 -7.7698 0.4984 -3.0818 -3.5370
hfenergy: -927.1508604 hartree
pointgroup: C01 [X(C13H27O1P1)]
dipole: -0.7015821 -0.3778688 1.5945136 debye
polarizability: 174.0245649|1.6473464|175.6493988|-3.6287397|3.3477532|148.9972153 unknown
InChI: InChI=1S/C13H27OP/c1-11(2)9-15(14,10-12(3)4)13-7-5-6-8-13/h11-13H,5-10H2,1-4H3
charge 0 multiplicity 1
42 atoms
P  0.208566 0.198536 -0.326119
O  0.66295 0.48729 -1.861075
C  -1.596187 -0.375038 -0.223177
C  -1.893467 -1.563424 -1.191595
C  -2.097817 -0.849591 1.165049
C  -3.007616 -2.411084 -0.486682
C  -3.389838 -1.624899 0.80196
C  0.341112 1.706968 0.822172
C  1.233713 -1.136234 0.562541
C  -0.197977 3.029176 0.215644
C  2.721738 -1.174869 0.122093
C  0.745514 3.56313 -0.889106
C  -0.398753 4.077513 1.337329
C  2.86623 -1.773523 -1.297628
C  3.555186 -1.969592 1.156525
H  -2.198046 0.50178 -0.536716
H  -0.988037 -2.174648 -1.364007
H  -2.205103 -1.188742 -2.180018
H  -2.27987 -0.017354 1.868682
H  -1.368832 -1.539141 1.63507
H  -2.616307 -3.409967 -0.21802
H  -3.881908 -2.57174 -1.1416
H  -4.202612 -0.90527 0.585765
H  -3.736405 -2.284099 1.617901
H  -0.206079 1.441745 1.748576
H  1.411013 1.820958 1.086391
H  1.149111 -0.922343 1.645954
H  0.759656 -2.119452 0.376596
H  -1.18831 2.828765 -0.246442
H  3.108731 -0.134385 0.092106
H  0.323013 4.472748 -1.354875
H  1.730317 3.830021 -0.456991
H  0.901062 2.797137 -1.669217
H  0.561647 4.292789 1.844153
H  -1.118069 3.728567 2.102623
H  -0.777327 5.028383 0.918663
H  2.267237 -1.191445 -2.019829
H  2.522421 -2.826966 -1.309558
H  3.924086 -1.759957 -1.619368
H  4.61825 -2.004924 0.854071
H  3.500531 -1.516131 2.164542
H  3.192676 -3.013086 1.231118
