program: Gaussian 09
title: 000099402
version: EM64L-G09RevD.01
frameworkgroup: C1[X(C15H31OP)]
method: RPBEPBE
basis: SDD
operation: Freq
keyword: #p
keyword: freq=noraman
keyword: PBEPBE/SDD
title: #p freq=noraman PBEPBE/SDD
converged: YES YES NO NO
title: Mulliken charges:
elementType: P O C C C C C C C C C C C C C C C H H H H H H H H H H H H H H H H H H H H H H H H H H H H H H H
charge: 1.051310 -0.688035 -0.441865 -0.437833 -0.442876 -0.440446 -0.422170 -0.728439 -0.762273 -0.334823 -0.323022 -0.334941 -0.335143 -0.355942 -0.354229 -0.694728 -0.692042 0.264440 0.224410 0.212300 0.218416 0.225754 0.257357 0.205708 0.206190 0.262953 0.255050 0.226973 0.260956 0.260463 0.192923 0.243130 0.199686 0.207967 0.181597 0.190669 0.189154 0.190423 0.202403 0.192740 0.195023 0.194156 0.217134 0.211256 0.207906 0.217647 0.211538 0.211175
chargesum: 0.00000
title: Mulliken charges with hydrogens summed into heavy atoms:
elementType: P O C C C C C C C C C C C C C C C
charge: 1.051310 -0.688035 -0.177425 -0.001123 0.001294 0.022619 0.046974 -0.246416 -0.240854 0.101230 0.084631 0.037324 0.044434 0.039201 0.034949 -0.058432 -0.051682
polarizability: 2.04731955e+02 4.23014985e+00 2.03823720e+02 -8.64361223e-01 6.66244155e-01 1.57628584e+02
1716.lowfreq: -19.2558 -11.3625 -6.4227 0.0014 0.0017 0.0020 5.3605 24.8588 31.8777
frequency: -16.7185 23.8710 31.4152 33.4910 33.9637 43.3440 56.6700 69.4274 89.0934 107.1597 119.5236 122.9876 123.8281 142.2602 167.7726 184.0559 197.9049 223.9537 228.3058 236.3809 249.8741 256.9722 326.8406 332.0657 382.7555 396.2011 441.6075 447.3149 564.0975 614.3626 657.6804 688.2305 715.0168 721.7807 730.9858 736.4848 752.0438 792.5822 811.2805 816.2049 824.0047 879.9948 893.0879 896.7033 902.9297 923.1235 926.6189 934.3073 946.9388 971.5589 998.4802 1001.9485 1026.5964 1048.1562 1051.0838 1056.3514 1063.4901 1072.6043 1075.4088 1077.0201 1078.1898 1105.2608 1106.7902 1137.5993 1141.5273 1194.6809 1195.3876 1196.8746 1199.9853 1213.6425 1220.5671 1248.6811 1250.9047 1252.6006 1259.1369 1275.0562 1277.8599 1282.9288 1287.1464 1289.0339 1293.8048 1296.9391 1305.6063 1316.9091 1321.0531 1331.9876 1335.4906 1349.3464 1351.3300 1387.8650 1391.6551 1430.5877 1435.9857 1456.3309 1463.0908 1464.8953 1465.4853 1468.2227 1469.4658 1470.2612 1476.3495 1478.2833 1479.4962 1480.2354 1483.1939 1487.6218 1487.9065 2952.8767 2959.4475 2964.9068 2965.3966 2970.9252 2971.4599 2973.0120 2974.2368 2980.3045 2984.1367 2991.0772 2994.8077 2997.1602 3003.3226 3007.4632 3009.2694 3015.0389 3018.2165 3024.0116 3035.7990 3037.9886 3040.5866 3046.7515 3061.0496 3067.7661 3068.2380 3071.0653 3071.4499 3071.5162 3073.6141 3094.9821
redmass: 2.8440 2.2827 1.8722 2.1465 1.9924 2.8557 2.9617 3.5784 2.3189 2.6061 2.0245 2.0694 2.5671 3.3540 4.0626 2.7170 4.1043 1.1832 3.5893 1.1139 2.8320 2.7385 3.0688 3.1750 3.3889 3.8447 3.0971 3.0435 3.0654 2.7031 3.4654 2.3502 1.2880 1.2173 1.2360 1.2243 2.0626 1.5945 1.3412 1.5949 1.2691 3.2800 1.7848 1.8099 2.0576 2.4907 1.6453 1.5844 1.3668 2.7512 3.9063 3.9163 1.4653 1.4735 2.8961 1.9293 1.3358 2.2941 2.2961 1.7958 2.3290 2.0055 2.1246 1.2070 1.6583 1.5831 1.4510 1.4869 1.3947 1.2964 1.2958 1.2910 1.2755 1.2217 1.3249 1.3092 1.3155 1.3204 1.0666 1.0736 1.1204 1.1047 1.1822 1.4231 1.3680 1.3984 1.4078 1.5868 1.5988 1.2155 1.2132 1.0810 1.0815 1.0771 1.0666 1.0712 1.0802 1.0784 1.0791 1.0711 1.0426 1.0469 1.0694 1.0703 1.0946 1.0885 1.0816 1.0590 1.0585 1.0602 1.0589 1.0544 1.0426 1.0590 1.0363 1.0634 1.0626 1.0602 1.0950 1.0978 1.0585 1.0609 1.0783 1.1006 1.1008 1.0690 1.1030 1.1041 1.0996 1.1013 1.1035 1.1014 1.1020 1.1023 1.1018 1.0997 1.0993 1.1046
irintensity: 0.2305 0.0937 0.1229 0.0153 0.2234 0.6475 0.5155 1.8970 0.4607 1.6186 0.7454 0.8488 3.1179 1.2502 3.4499 0.4340 11.0072 0.5318 5.8336 0.0573 4.0002 0.1439 0.0394 1.2037 15.7843 19.0034 0.6345 2.8301 22.6795 0.1110 5.3405 18.7410 19.4690 13.1403 13.0860 2.7843 29.4979 4.0135 8.6794 5.9391 10.5778 0.1038 4.8863 8.7603 4.0501 28.3890 7.1487 12.4802 3.0558 33.3502 1.7688 2.6259 0.7639 2.9480 0.9268 5.5722 8.7882 2.2873 1.9022 5.8046 0.5632 32.4574 21.3773 4.4638 1.2031 0.2933 1.5159 1.2052 4.0774 11.5902 12.8046 4.6092 2.1714 3.6422 0.3660 0.8581 0.6845 0.0845 1.0361 1.6883 0.0073 4.0558 1.8463 2.6307 4.2166 0.4294 0.6337 0.2069 0.6806 11.3683 11.5201 9.1166 6.4070 0.0189 0.3225 5.4994 12.2861 8.4053 5.3520 0.7685 12.2388 10.7423 11.0790 1.5852 8.2793 22.9066 15.4252 9.1540 0.5688 4.0555 6.5836 75.7858 26.4243 87.7819 37.5050 23.7337 22.9127 17.7920 6.2245 0.9101 12.2542 45.9793 73.8426 3.3195 5.9851 57.6894 23.9196 41.4924 27.0792 14.6161 22.9874 62.1084 45.9852 52.1368 32.0105 83.4032 49.8700 53.8247
temp: 298.150 k
press: 1.00000 atm
elementType: 15 8 6 6 6 6 6 6 6 6 6 6 6 6 6 6 6 1 1 1 1 1 1 1 1 1 1 1 1 1 1 1 1 1 1 1 1 1 1 1 1 1 1 1 1 1 1 1
symmnumber: 1
zpe: 1131256.6 jmol-1
zpe.correction: 0.430873 hartree
zpe.thermalcorrener: 0.452786 hartree
zpe.thermalcorrenthalpy: 0.453731 hartree
zpe.thermalcorrgfe: 0.376583 hartree
zpe.sumelectzpe: -1005.219518 hartree
zpe.sumelectthermal: -1005.197605 hartree
zpe.sumelectthermalent: -1005.196661 hartree
zpe.sumelectthermalfe: -1005.273808 hartree
dipole: -0.9587 3.0312 -3.4353
dipole: 4.6806
quadrupole: -111.4025 -119.6759 -122.7150
quadrupole: 1.2232 -0.1184 8.6890
quadrupole: 6.5286 -1.7448 -4.7839 1.2232 -0.1184 8.6890
hfenergy: -1005.6503914 hartree
pointgroup: C01 [X(C15H31O1P1)]
dipole: -0.1078624 1.2625968 -1.3361601 debye
polarizability: 206.4960452|3.639134|202.0313973|-0.6963473|1.3770803|157.6568167 unknown
InChI: InChI=1S/C15H31OP/c1-3-5-9-13-17(16,14-10-6-4-2)15-11-7-8-12-15/h15H,3-14H2,1-2H3
charge 0 multiplicity 1
48 atoms
P  -0.38422 -0.841028 0.40753
O  -0.270907 -1.897908 1.636618
C  -1.736881 -1.259267 -0.87193
C  -3.165985 -1.142612 -0.278439
C  -1.655729 -2.753235 -1.293321
C  -3.378857 -2.47527 0.49684
C  -2.458101 -3.529524 -0.203986
C  1.22049 -0.740847 -0.598721
C  -0.729185 0.924781 1.007754
C  2.450108 -0.498974 0.301867
C  -0.933033 1.988997 -0.090868
C  3.784177 -0.644881 -0.466062
C  -1.172947 3.40125 0.495271
C  5.019972 -0.351067 0.415061
C  -1.384933 4.477845 -0.593947
C  6.353605 -0.515878 -0.344987
C  -1.620529 5.886211 -0.006726
H  -1.571612 -0.572121 -1.72415
H  -3.312434 -0.250209 0.357856
H  -3.883897 -1.064092 -1.11873
H  -2.135376 -2.861132 -2.285702
H  -0.620082 -3.127709 -1.389148
H  -3.058253 -2.35453 1.545621
H  -4.441885 -2.775866 0.496196
H  -3.038792 -4.355153 -0.653138
H  -1.763701 -3.957998 0.537084
H  1.317164 -1.709901 -1.124956
H  1.112163 0.047573 -1.368005
H  -1.618049 0.852484 1.662489
H  0.123631 1.186747 1.662483
H  2.398452 0.51546 0.748332
H  2.422217 -1.217997 1.144329
H  -0.047535 2.025564 -0.758189
H  -1.797855 1.71481 -0.728524
H  3.789425 0.037372 -1.34237
H  3.860727 -1.675103 -0.871914
H  -0.309891 3.686835 1.131703
H  -2.058121 3.375891 1.163925
H  5.007652 -1.025841 1.294876
H  4.945531 0.681153 0.814489
H  -2.249247 4.190601 -1.227059
H  -0.501093 4.497762 -1.263897
H  7.21998 -0.300228 0.30694
H  6.466985 -1.548107 -0.726695
H  6.404581 0.169385 -1.212455
H  -1.775171 6.636446 -0.803654
H  -2.513016 5.89876 0.646919
H  -0.755845 6.212451 0.601389
