program: Gaussian 09
title: 000099358
version: EM64L-G09RevD.01
frameworkgroup: C1[X(C11H13NO)]
method: RPBEPBE
basis: SDD
operation: Freq
keyword: #p
keyword: freq=noraman
keyword: PBEPBE/SDD
title: #p freq=noraman PBEPBE/SDD
converged: YES YES NO NO
title: Mulliken charges:
elementType: O N C C C C C C C C C C C H H H H H H H H H H H H H
charge: -0.441269 -0.023488 0.168045 -0.695847 -0.686057 0.056469 0.350759 0.145162 -0.315486 -0.287900 -0.146556 -0.515294 -0.770121 0.214936 0.220358 0.236278 0.210060 0.242807 0.230847 0.254870 0.336241 0.237238 0.263109 0.229137 0.228850 0.256853
chargesum: 0.00000
title: Mulliken charges with hydrogens summed into heavy atoms:
elementType: O N C C C C C C C C C C C
charge: -0.105028 -0.023488 0.168045 -0.024275 -0.002342 0.056469 0.350759 0.145162 -0.060616 -0.050663 -0.146556 -0.252185 -0.055281
polarizability: 2.32023826e+02 3.94035376e+00 1.12773767e+02 -1.66900859e-02 2.37216359e-02 7.88324872e+01
1716.lowfreq: -34.1610 -7.2364 -4.8841 -0.0005 -0.0003 -0.0003 2.2823 10.4359 47.6121
frequency: -34.1500 10.2924 47.6120 48.6104 112.8065 143.4745 190.1559 222.0454 241.7439 253.4110 309.8816 330.4385 343.7031 369.1048 397.7884 411.9415 453.4381 483.1976 517.5774 547.6344 561.3350 615.8992 635.7295 744.8005 756.6112 811.2147 851.3767 863.2163 925.7840 935.6718 938.3620 976.9771 981.6486 998.7002 1005.6186 1047.6179 1099.6017 1136.1207 1148.1029 1186.1188 1248.4715 1278.2444 1294.4773 1300.7028 1322.4477 1354.6204 1372.7142 1391.1262 1391.5983 1448.3534 1451.6626 1457.6289 1469.0968 1469.2687 1476.8160 1481.9595 1533.4373 1588.4711 2248.4564 2982.6079 2985.6883 3002.2235 3059.5344 3085.2908 3096.9929 3106.6300 3116.2202 3118.9035 3135.8473 3138.0779 3162.2040 3542.2258
redmass: 1.0424 3.6304 4.0995 4.2650 3.7124 3.7388 1.0541 3.0378 4.0749 1.2033 1.1619 2.8515 2.3808 3.3079 3.7523 3.1853 3.6496 5.2555 3.9990 5.5772 5.1730 4.3998 7.9713 2.9976 5.0905 4.7450 1.4200 3.7042 1.5235 1.5023 2.2925 1.5099 1.3431 1.3045 2.9244 1.5940 1.5956 1.3333 2.1315 2.7278 2.8264 2.4894 1.7608 4.4622 2.2659 2.4896 1.2133 1.2525 1.2097 1.3426 1.0549 1.0480 1.0741 1.0470 1.3662 1.3589 4.5378 6.3317 11.9822 1.0384 1.0348 1.0347 1.0972 1.1000 1.1010 1.1003 1.1010 1.0980 1.0922 1.0885 1.0982 1.0661
irintensity: 0.1878 0.1926 0.2868 0.1545 0.2324 1.4657 4.0821 0.9562 0.9633 6.7371 145.2532 2.4091 43.6624 4.2257 0.1091 12.2835 5.7169 10.7294 3.7074 8.3138 9.4952 5.1195 1.6776 3.9240 8.2668 6.6621 32.3075 28.9129 1.1433 2.7283 23.8508 6.2962 0.6806 1.1865 6.8659 10.3861 64.7789 17.1883 38.1233 67.8887 1.4046 15.9220 1.9515 1.8420 119.3172 16.5542 23.5242 14.0744 18.3183 40.4991 7.4794 2.3385 6.4099 18.6613 55.2613 25.7750 24.2441 15.9622 2.2276 22.9492 18.3535 17.0713 19.1751 27.9880 12.7696 43.7037 20.8353 9.0807 15.1769 8.4452 11.0048 11.0358
temp: 298.150 k
press: 1.00000 atm
elementType: 8 7 6 6 6 6 6 6 6 6 6 6 6 1 1 1 1 1 1 1 1 1 1 1 1 1
symmnumber: 1
zpe: 548890.7 jmol-1
zpe.correction: 0.209061 hartree
zpe.thermalcorrener: 0.222367 hartree
zpe.thermalcorrenthalpy: 0.223311 hartree
zpe.thermalcorrgfe: 0.167343 hartree
zpe.sumelectzpe: -555.929330 hartree
zpe.sumelectthermal: -555.916025 hartree
zpe.sumelectthermalent: -555.915081 hartree
zpe.sumelectthermalfe: -555.971049 hartree
dipole: 0.4817 3.5023 -0.4893
dipole: 3.5689
quadrupole: -73.2689 -76.6153 -77.1236
quadrupole: 2.2988 3.1529 2.5291
quadrupole: 2.4003 -0.9460 -1.4543 2.2988 3.1529 2.5291
hfenergy: -556.1383916 hartree
pointgroup: C01 [X(C11H13N1O1)]
dipole: 0.1937682 -1.3851701 -0.1238682 debye
dipolederiv: -0.8681065 -0.1167847 -0.1624489 -0.045898 -0.4891208 0.2301684 -0.3209414 0.24492 -0.5886081 -0.6139466 -0.0166679 -0.0028164 0.1334212 -0.3070525 -0.0108126 0.0252133 -0.0135482 -0.2430999 1.1073074 0.0442752 0.0562019 0.0516575 0.4875926 -0.1121309 0.1448711 -0.1345303 0.6068531 -0.1364542 -0.0793814 -0.0042659 0.0017137 -0.1368314 0.0394281 -0.0016511 -0.0329583 0.0198685 -0.1659102 0.0220268 0.0597151 -0.0116474 -0.0190542 -0.0882971 -0.0631357 -0.0310367 -0.027624 -0.3173426 -0.011154 -0.0546672 -0.1448797 -0.191427 0.0193003 0.0263982 0.0171986 -0.2251252 0.3779632 -0.0685886 -0.0082183 0.0565793 -0.1250119 -0.0425618 0.0187078 -0.0404582 0.088076 0.8255212 -0.0071084 0.000891 0.0834757 0.1032655 0.0164381 0.0218734 0.0160456 0.0253947 0.0662892 0.0090695 0.0021002 -0.0201477 0.128397 0.0519543 -0.0101734 0.0485328 -0.1115054 -0.3872203 -0.0788904 -0.0161442 -0.3425382 -0.0079338 0.0221308 -0.0716063 0.0243171 -0.1268019 -0.1175544 0.0391546 0.0070743 0.0024133 -0.1317301 -0.0186244 0.010178 -0.021687 -0.0783214 0.0833218 0.0304052 0.005759 -0.08201 0.2995849 0.0701262 -0.0118329 0.0734139 -0.0500758 -0.3542331 -0.0000767 -0.0020659 0.1121419 0.0408286 -0.0023122 0.018538 -0.0026876 0.0576016 0.0859002 0.0417405 0.0902201 0.0372087 0.0082407 -0.0756803 0.0610844 -0.1108031 -0.0767677 0.0951324 0.0285969 -0.0615599 0.0203659 0.0174157 0.0838709 -0.0427346 0.1134 -0.0667706 -0.1909368 -0.0232945 -0.0082901 -0.0192773 0.0697457 0.0004073 -0.0165363 -0.0027174 0.107425 0.1035254 0.0392342 -0.0568027 0.0221714 0.0323785 0.1105 -0.0438935 0.0693145 -0.0694152 0.0946777 -0.0902043 0.0031114 -0.0746669 -0.0936622 -0.0351704 -0.0075049 -0.007299 0.0876174 -0.1923812 0.0197324 0.0131302 0.038757 0.1007785 -0.0230045 0.0290639 -0.0142344 0.082578 0.059756 -0.0844164 -0.0180029 -0.0708593 -0.0198102 -0.0325991 -0.0140222 -0.0330459 0.1355268 0.3524339 0.1163561 0.1209701 0.118843 0.2230854 -0.1409981 0.2210911 -0.1002557 0.1501855 0.0062464 0.0916244 0.0182939 0.116472 -0.032885 -0.0370428 0.023583 -0.0370431 0.1455526 0.0318722 0.0824287 0.0158502 0.0932208 -0.0113775 -0.0276286 0.0175058 -0.0280026 0.1195104 -0.0144553 0.0201879 -0.0442886 0.0409992 0.0237752 0.1144153 -0.104286 0.0941859 -0.0029512 -0.0153825 0.002342 0.0484713 -0.0005789 0.0928638 -0.0759164 0.1130769 -0.0552121 -0.0709655 0.0839769 -0.0106071 -0.0022176 -0.1169374 -0.0620554 -0.0359605 -0.0228667 -0.0358091 0.1118425 unknown
polarizability: 232.0482721|-3.5645696|110.9999584|-0.1134952|7.4943319|80.5818497 unknown
InChI: InChI=1S/C11H13NO/c1-9-4-5-10(8-12-9)6-7-11(2,3)13/h4-5,8,13H,1-3H3
charge 0 multiplicity 1
26 atoms
O  -3.902712 0.751243 -1.193141
N  2.820286 1.155524 0.263597
C  -3.42834 -0.031794 -0.012143
C  -4.005741 -1.468104 -0.079179
C  -3.981026 0.749649 1.197448
C  -1.94602 -0.068308 0.003483
C  0.723257 -0.105687 0.001794
C  3.536101 0.007138 0.033875
C  1.478741 -1.290839 -0.23576
C  2.883473 -1.230488 -0.218683
C  -0.708739 -0.101159 -0.000896
C  1.462161 1.090141 0.246261
C  5.045055 0.119643 0.062915
H  -3.627021 -2.006521 -0.966858
H  -3.727749 -2.048169 0.818589
H  -5.106128 -1.409712 -0.142356
H  -3.711947 0.247944 2.142217
H  -3.574251 1.773644 1.20367
H  -5.080153 0.808088 1.115928
H  0.959067 -2.235134 -0.428049
H  -3.48635 0.368764 -2.009012
H  3.481209 -2.130405 -0.398382
H  0.929121 2.029352 0.433796
H  5.481342 -0.530289 0.844605
H  5.489657 -0.18703 -0.902476
H  5.331606 1.162111 0.269358
