program: Gaussian 09
title: 000099458
version: EM64L-G09RevD.01
frameworkgroup: C1[X(C23H33NO3)]
method: RPBEPBE
basis: SDD
operation: Freq
keyword: #p
keyword: freq=noraman
keyword: PBEPBE/SDD
title: #p freq=noraman PBEPBE/SDD
converged: YES YES NO NO
title: Mulliken charges:
elementType: O O O N C C C C C C C C C C C C C C C C C C C C C C C H H H H H H H H H H H H H H H H H H H H H H H H H H H H H H H H H
charge: -0.271683 -0.434111 -0.251253 -0.111856 -0.099083 -0.195610 -0.164672 0.297012 0.279556 -0.549425 -0.521615 -0.493655 0.479107 -0.575030 -0.521734 0.349579 -0.476023 -0.833522 -0.834004 -0.408363 -0.679550 -0.482808 0.027409 0.051044 -0.787095 0.286329 -0.764161 0.198803 0.248314 0.218827 0.222384 0.215385 0.199467 0.240006 0.215528 0.214694 0.223146 0.227404 0.210299 0.222147 0.213573 0.243676 0.225261 0.223536 0.227008 0.222623 0.225531 0.238073 0.253492 0.218158 0.217747 0.217235 0.250799 0.275559 0.238070 0.233973 0.366831 0.247169 0.246265 0.244232
chargesum: 0.00000
title: Mulliken charges with hydrogens summed into heavy atoms:
elementType: O O O N C C C C C C C C C C C C C C C C C C C C C C C
charge: -0.271683 -0.067280 -0.251253 -0.111856 0.099720 0.052704 0.054156 0.297012 0.279556 -0.111656 -0.082141 -0.063433 0.479107 -0.124479 -0.089288 0.349579 -0.262450 -0.141050 -0.158843 -0.170290 -0.207900 -0.047826 0.278208 0.051044 -0.039493 0.286329 -0.026494
polarizability: 3.40332366e+02 9.56357029e+00 2.67619962e+02 7.97269904e+00 -5.69617397e+00 1.81948956e+02
1716.lowfreq: -8.7800 -1.8666 -0.0005 -0.0001 0.0008 3.4958 21.7660 25.1229 36.0592
frequency: 21.7233 24.7561 36.0344 40.1147 49.5838 55.0446 65.7397 69.9214 85.2700 91.2533 145.8583 150.6307 158.6112 178.2515 190.6135 213.5731 227.2796 232.3537 235.5786 246.4070 272.4833 274.3542 289.1996 302.7667 305.3952 317.2112 327.6415 334.8776 344.0121 365.4527 385.6491 394.1248 413.5949 420.9316 434.9425 444.4458 449.5706 475.4223 494.3650 502.1261 526.6346 565.3880 573.8515 579.6750 595.3683 607.7732 629.6358 656.2467 680.0473 694.7221 709.5302 733.7434 796.3653 805.4657 816.1506 825.0175 832.4588 838.4407 854.3853 857.8561 887.3013 893.8514 913.3650 922.9889 936.9466 939.9998 956.2763 961.5101 975.8168 987.1231 992.4586 995.5266 999.2598 1007.0701 1020.1717 1027.4889 1036.5791 1038.4840 1041.6431 1051.2897 1073.6177 1078.2418 1098.1619 1116.1153 1126.5832 1131.2428 1134.1019 1139.3379 1143.6993 1159.7337 1177.3945 1183.9877 1189.6265 1199.2459 1205.5105 1222.5688 1230.8007 1240.4704 1249.9873 1254.2991 1261.1039 1270.4322 1276.4537 1282.0582 1291.7682 1296.5296 1311.9637 1322.4686 1325.2515 1328.7922 1335.7706 1339.6221 1343.0568 1346.8623 1353.3420 1365.3809 1369.4367 1374.8385 1381.4204 1383.5479 1386.5448 1388.3459 1453.5678 1455.3518 1455.7500 1456.9878 1460.3741 1461.0518 1461.6599 1462.4255 1470.6411 1474.4492 1474.4826 1482.8345 1484.7532 1488.9423 1493.9744 1559.5510 1593.5865 1642.9974 1683.2610 2915.6379 2919.9275 2927.3891 2944.1679 2964.4878 2966.7263 2973.7356 2975.6622 2982.5599 2985.1396 2991.6008 2992.8553 2996.6318 2999.0136 3005.2691 3017.9413 3030.4604 3036.7512 3043.2502 3053.9897 3060.1154 3062.6069 3074.7690 3076.9472 3077.0360 3078.8253 3085.4850 3087.2372 3096.8012 3127.0654 3139.8068 3151.9817 3572.9512
redmass: 4.4135 1.2618 2.4740 1.4933 3.4679 3.9485 3.2744 2.7914 4.5253 3.5871 2.8426 3.1884 4.2835 5.1354 1.3174 2.0583 1.7823 2.6990 2.7159 2.3240 2.3075 3.0560 2.3405 3.2129 2.6364 2.8280 2.8804 2.8398 2.8863 2.9545 2.6799 3.4880 1.3721 3.2723 3.8447 2.7018 2.7612 3.0465 3.1544 2.4294 2.5790 3.2117 3.3757 3.3762 3.6016 3.4823 3.4582 3.6854 3.0335 3.6542 3.1516 2.8692 1.7805 1.9735 1.6860 1.8127 2.1769 2.5965 3.4521 3.2141 1.8253 2.1210 1.9516 2.0884 2.0816 2.1678 1.9850 2.1732 1.9862 2.2786 2.0218 2.0741 2.0438 2.0778 2.0079 1.8419 1.6171 1.7240 1.6592 2.1477 2.4111 2.7825 1.6161 1.6850 1.5841 2.1615 1.8573 1.9391 2.2786 1.9039 2.1994 1.8278 2.3838 1.8822 3.5684 1.8438 1.5914 1.4477 1.5456 1.3405 1.5256 1.4731 1.3063 1.5093 1.3296 1.4196 1.3582 1.4445 1.3685 1.5016 1.3613 1.3490 1.4217 1.6975 1.4634 2.2917 1.6494 1.5926 1.2255 1.2575 1.3404 1.2606 1.0605 1.0892 1.0519 1.0911 1.0852 1.0973 1.0764 1.0752 1.0874 1.0573 1.0828 1.0760 1.0603 1.0569 1.0636 5.2453 7.0879 9.4236 7.8084 1.0816 1.0798 1.0667 1.0678 1.0654 1.0629 1.0722 1.0749 1.0385 1.0372 1.0595 1.0392 1.0617 1.0908 1.0378 1.0847 1.0926 1.0968 1.0978 1.0978 1.1007 1.0970 1.0989 1.0978 1.0959 1.0979 1.0986 1.0904 1.0952 1.0986 1.1018 1.0944 1.0673
irintensity: 0.0987 0.2092 1.9104 0.3995 0.2143 0.1219 1.5585 0.2203 0.4778 1.2790 2.8020 0.5355 2.1926 0.2976 1.0322 0.2686 0.5242 0.2910 0.6353 0.6932 1.7454 1.5862 2.8662 2.8034 6.4744 2.1196 1.4053 3.4796 3.3250 0.1895 8.7283 4.2502 89.4021 1.6558 3.5041 3.6927 1.8241 1.9835 2.9350 26.9585 3.3980 2.7394 6.2937 0.7553 4.5209 2.0275 1.9303 8.3001 9.8667 21.8531 10.8817 2.9919 7.8536 8.8978 17.3808 7.6737 4.1407 30.9224 58.2867 17.8852 20.7025 35.1436 2.3175 16.1265 19.7199 41.8508 54.8519 30.6130 0.8224 11.9813 11.1236 3.9932 132.4210 4.0507 9.8064 12.8888 9.6091 17.9114 8.6221 5.9772 5.4312 6.9983 7.3801 4.6359 1.2150 4.6070 12.6270 8.2931 1.7353 4.1221 2.3148 2.6348 4.2869 13.8917 418.4464 1.3571 79.5317 0.1164 12.8000 1.0860 0.2033 16.3560 9.4523 11.4956 1.9486 1.5083 1.7465 1.4666 0.0018 2.4412 0.3317 3.5530 1.4895 0.4280 1.3012 0.1044 11.5764 4.5003 18.5120 65.8919 38.8696 18.2829 23.1769 6.4884 20.8363 10.7071 5.3164 21.0604 1.5553 4.0618 9.7759 18.6544 1.4203 18.4160 11.9735 2.1943 9.2971 2.2828 8.3969 167.8123 1.8966 0.1885 19.1427 39.0642 32.3173 13.5086 32.7864 6.3240 36.4797 26.6831 9.5188 42.6223 10.9392 22.3604 49.4772 3.6254 11.7455 30.0850 38.5524 49.6672 14.6915 39.1745 31.1627 19.7803 39.6599 16.3119 43.1194 35.1965 40.2620 9.8982 7.4816 11.0849 27.5956 63.3543
temp: 298.150 k
press: 1.00000 atm
elementType: 8 8 8 7 6 6 6 6 6 6 6 6 6 6 6 6 6 6 6 6 6 6 6 6 6 6 6 1 1 1 1 1 1 1 1 1 1 1 1 1 1 1 1 1 1 1 1 1 1 1 1 1 1 1 1 1 1 1 1 1
symmnumber: 1
zpe: 1348504.0 jmol-1
zpe.correction: 0.513618 hartree
zpe.thermalcorrener: 0.541018 hartree
zpe.thermalcorrenthalpy: 0.541963 hartree
zpe.thermalcorrgfe: 0.455336 hartree
zpe.sumelectzpe: -1174.546090 hartree
zpe.sumelectthermal: -1174.518690 hartree
zpe.sumelectthermalent: -1174.517746 hartree
zpe.sumelectthermalfe: -1174.604372 hartree
dipole: -0.9178 -0.9788 1.2459
dipole: 1.8310
quadrupole: -162.8383 -155.2360 -165.8180
quadrupole: -11.5539 8.8261 3.1327
quadrupole: -1.5408 6.0614 -4.5206 -11.5539 8.8261 3.1327
hfenergy: -1175.0597085 hartree
pointgroup: C01 [X(C23H33N1O3)]
dipole: 0.3710035 -0.389209 -0.4793954 debye
polarizability: 339.858708|-9.7677985|267.7338584|11.5497614|4.8727787|182.3087184 unknown
InChI: InChI=1S/C23H33NO3/c1-14(24-26)19-7-8-20-18-6-5-16-13-17(27-15(2)25)9-11-22(16,3)21(18)10-12-23(19,20)4/h5,7,17-18,20-21,26H,6,8-13H2,1-4H3
charge 0 multiplicity 1
60 atoms
O  -5.82526 -0.769668 -0.087671
O  6.78641 -2.172053 0.649152
O  -6.529565 1.092039 1.136658
N  5.498588 -1.52345 0.357304
C  -0.008615 -0.310038 0.156534
C  0.617984 0.995095 -0.43719
C  2.035421 1.152668 0.134651
C  2.987475 -0.046606 -0.195912
C  -1.446073 -0.596121 -0.426777
C  0.942829 -1.543039 0.064593
C  2.403835 -1.282806 0.531847
C  -0.267598 2.209666 -0.074365
C  -2.28579 0.698062 -0.42731
C  2.889206 2.41399 -0.158406
C  -2.158944 -1.63933 0.504044
C  4.33654 0.545947 0.280278
C  -1.744579 1.933598 -0.248752
C  3.13298 -0.32322 -1.725401
C  -1.375285 -1.153833 -1.882868
C  4.270371 1.918904 0.249634
C  -3.787646 0.542579 -0.654034
C  -3.662655 -1.84135 0.20564
C  -4.398257 -0.502739 0.300657
C  5.563152 -0.213561 0.573686
C  6.802571 0.508983 1.066611
C  -6.792472 0.117493 0.39419
C  -8.163889 -0.2661 -0.121306
H  -0.153096 -0.096026 1.24151
H  0.664093 0.914579 -1.542429
H  1.924156 1.133822 1.243754
H  0.970888 -1.915957 -0.975897
H  0.527272 -2.368712 0.673963
H  2.422019 -1.099559 1.625658
H  3.021935 -2.178092 0.344009
H  0.021051 3.086807 -0.688668
H  -0.069986 2.507989 0.98004
H  2.564794 3.306383 0.408134
H  2.871928 2.693775 -1.234855
H  -2.044937 -1.303895 1.555873
H  -1.645073 -2.615263 0.421857
H  -2.415978 2.805199 -0.229944
H  3.885921 -1.11567 -1.882515
H  2.187057 -0.656204 -2.185787
H  3.471131 0.579882 -2.265615
H  -0.725536 -0.523404 -2.516142
H  -0.981509 -2.186157 -1.900787
H  -2.371675 -1.174701 -2.356928
H  5.10925 2.59454 0.447388
H  -4.293482 1.514706 -0.519741
H  -3.992401 0.201886 -1.690145
H  -3.808761 -2.262598 -0.807177
H  -4.098422 -2.562358 0.922079
H  -4.39784 -0.1119 1.336335
H  7.525869 -0.204235 1.488238
H  7.295088 1.042389 0.231703
H  6.532535 1.255814 1.83241
H  6.575948 -3.124934 0.475787
H  -8.299602 -1.359295 -0.094236
H  -8.266646 0.056364 -1.173531
H  -8.938926 0.232715 0.478969
