program: Gaussian 09
title: 000097393
version: EM64L-G09RevD.01
frameworkgroup: C1[X(C15H13NO)]
method: RPBEPBE
basis: SDD
operation: Freq
keyword: #p
keyword: freq=noraman
keyword: PBEPBE/SDD
title: #p freq=noraman PBEPBE/SDD
converged: YES YES NO NO
title: Mulliken charges:
elementType: O N C C C C C C C C C C C C C C C H H H H H H H H H H H H H
charge: -0.253646 -0.081379 0.533826 -0.717097 0.036431 -0.579333 0.501616 0.215031 -0.347597 -0.358188 0.219367 -0.450864 -0.378173 -0.222022 -0.224310 -0.764650 -0.248954 0.229896 0.225826 0.259381 0.247054 0.250676 0.231931 0.241025 0.225179 0.225223 0.248119 0.248085 0.259395 0.228153
chargesum: 0.00000
title: Mulliken charges with hydrogens summed into heavy atoms:
elementType: O N C C C C C C C C C C C C C C C
charge: -0.253646 -0.081379 0.533826 -0.261375 0.036431 -0.319953 0.501616 0.215031 -0.100543 -0.107512 0.219367 -0.218933 -0.137148 0.003157 0.000913 -0.009051 -0.020801
polarizability: 2.55739525e+02 -3.80227379e+00 1.28919220e+02 -2.19389798e+01 5.57109625e-01 1.22336768e+02
1716.lowfreq: -8.6882 -0.0006 -0.0005 0.0004 3.8184 6.4484 18.8084 23.9922 53.4409
frequency: 15.5242 23.3904 53.4383 94.0419 112.1014 175.8995 187.2332 224.7838 272.3521 280.8729 325.0478 352.6249 404.3101 429.3480 446.2240 469.4112 499.0738 558.0775 586.0945 617.6158 625.2213 660.6789 670.4062 704.1617 732.7122 756.5288 775.6428 797.9643 816.1800 829.3318 833.8548 855.4725 891.0361 914.8722 926.9373 952.7655 963.8694 977.7414 990.6243 995.6842 1008.5351 1026.6285 1047.2844 1081.3618 1096.7448 1130.2564 1150.0487 1171.3417 1183.3681 1187.7675 1206.1828 1217.5709 1251.0798 1274.3198 1297.8683 1334.1875 1382.4283 1394.2960 1399.2500 1433.5976 1440.6951 1455.1829 1459.3724 1463.1186 1466.3598 1484.0849 1562.9203 1593.6269 1612.5501 1613.7987 1628.5035 2973.9850 2998.6483 3020.5472 3077.4875 3114.2926 3120.3087 3131.9921 3133.4252 3138.2457 3144.3336 3153.8230 3162.5440 3175.8453
redmass: 3.9084 4.5737 4.7083 1.2649 2.4845 4.4911 4.6063 4.1784 3.6818 4.7884 2.6348 3.9385 2.8077 2.9769 3.4644 4.4284 4.4759 5.1472 4.2406 6.1820 5.2428 4.5989 5.7122 2.0175 2.1757 4.5141 2.7994 2.9754 3.8787 2.4880 3.6873 1.2477 1.4488 1.7034 2.3129 1.5422 1.6897 1.3928 6.1192 1.3246 2.0531 2.2053 1.4900 1.5986 3.7623 2.0114 1.6422 1.0583 1.1446 1.1178 2.8839 2.4695 4.4446 1.5918 1.5389 1.3282 7.1430 3.2023 1.3572 3.8408 2.1162 1.0440 1.1413 1.4016 2.0717 2.1983 7.1696 6.1091 8.2416 6.1852 7.7970 1.0599 1.0380 1.1004 1.0976 1.0871 1.0863 1.0986 1.0911 1.0895 1.0960 1.0928 1.1015 1.0961
irintensity: 0.0715 0.0299 0.6235 1.1958 2.6023 0.4271 0.6535 2.6656 4.3829 1.0749 0.6544 1.7103 0.1885 5.1035 3.0172 1.6099 9.3254 1.6798 5.9263 0.3089 2.2200 9.9711 3.9257 41.6594 34.6191 3.2251 36.8609 34.1743 22.7096 32.3581 19.5658 0.0068 8.6863 5.6903 9.2123 7.4312 5.8482 0.0865 0.3099 0.4375 0.0521 10.5127 5.0524 16.7248 24.4400 6.5539 40.9673 0.3825 2.6050 1.6828 3.7788 15.6692 15.5639 4.6694 1.2863 0.7185 0.7536 3.3273 21.0497 19.3640 6.6665 18.1434 29.7923 15.7756 18.7568 18.4769 93.9040 1.6468 6.0598 8.5402 1.3988 27.6208 14.4261 11.4696 9.6712 9.0422 3.1039 4.7349 12.3163 5.2583 44.0197 5.4697 26.3190 4.7112
temp: 298.150 k
press: 1.00000 atm
elementType: 8 7 6 6 6 6 6 6 6 6 6 6 6 6 6 6 6 1 1 1 1 1 1 1 1 1 1 1 1 1
symmnumber: 1
zpe: 623248.2 jmol-1
zpe.correction: 0.237383 hartree
zpe.thermalcorrener: 0.251396 hartree
zpe.thermalcorrenthalpy: 0.252340 hartree
zpe.thermalcorrgfe: 0.194084 hartree
zpe.sumelectzpe: -708.193426 hartree
zpe.sumelectthermal: -708.179414 hartree
zpe.sumelectthermalent: -708.178469 hartree
zpe.sumelectthermalfe: -708.236725 hartree
dipole: 0.2068 -0.7286 -0.6089
dipole: 0.9718
quadrupole: -84.2809 -98.5699 -97.0707
quadrupole: 2.3515 -2.8403 -3.0874
quadrupole: 9.0263 -5.2627 -3.7635 2.3515 -2.8403 -3.0874
hfenergy: -708.4308092 hartree
pointgroup: C01 [X(C15H13N1O1)]
dipole: 0.0619926 0.2109894 -0.3127629 debye
polarizability: 252.0722891|29.9888539|125.7007561|-8.4243967|-0.7611732|129.2224679 unknown
InChI: InChI=1S/C15H13NO/c1-11-16-14-10-13(7-8-15(14)17-11)9-12-5-3-2-4-6-12/h2-8,10H,9H2,1H3
charge 0 multiplicity 1
30 atoms
O  -3.723983 0.126218 -1.056298
N  -3.467998 -0.932843 0.993194
C  0.069436 0.437153 0.689036
C  1.421293 0.555348 1.39492
C  -2.236311 -0.31198 0.631378
C  -0.996444 -0.265061 1.300278
C  2.635533 0.2243 0.527512
C  -2.392818 0.335817 -0.623698
C  -0.125548 1.071796 -0.577166
C  -1.361772 1.036752 -1.260681
C  -4.3029 -0.662423 0.003599
C  3.732758 1.117603 0.448446
C  2.702906 -0.996809 -0.193289
C  4.873029 0.801579 -0.326834
C  3.839122 -1.317033 -0.967357
C  -5.729543 -1.05123 -0.167189
C  4.930543 -0.418452 -1.037308
H  1.41319 -0.108485 2.282053
H  1.538666 1.585734 1.785965
H  -0.869526 -0.761597 2.267648
H  0.720107 1.596908 -1.035325
H  -1.500129 1.52644 -2.228056
H  3.695941 2.066815 0.998098
H  1.856876 -1.69348 -0.150407
H  5.711622 1.505586 -0.375878
H  3.875131 -2.265054 -1.51632
H  -6.374537 -0.159342 -0.260663
H  -5.868328 -1.656705 -1.080722
H  -6.049765 -1.63825 0.706195
H  5.812048 -0.666306 -1.639231
