program: Gaussian 09
title: 000010814
version: EM64L-G09RevD.01
frameworkgroup: C1[X(C14H10O9)]
method: RPBEPBE
basis: SDD
operation: Freq
keyword: #pfreq=noraman
keyword: PBEPBE/SDD
title: #p freq=noraman PBEPBE/SDD
converged: YES YES NO NO
title: Mulliken charges:
elementType: O O O O O O O O O C C C C C C C C C C C C C C H H H H H H H H H H
charge: -0.282778 -0.446947 -0.426259 -0.432258 -0.484661 -0.467754 -0.358122 -0.442956 -0.247368 0.175118 -0.004752 -0.459105 0.328458 0.457280 0.222802 -0.480895 0.227449 -0.480665 -0.590493 0.275697 0.304023 -0.041403 0.092497 0.306110 0.299530 0.311083 0.286578 0.409902 0.391415 0.388145 0.380648 0.401739 0.387943
chargesum: 0.00000
title: Mulliken charges with hydrogens summed into heavy atoms:
elementType: O O O O O O O O O C C C C C C C C C C C C C C
charge: -0.282778 -0.037045 -0.034843 -0.044113 -0.104014 -0.066015 -0.358122 -0.055012 -0.247368 0.175118 -0.004752 -0.152995 0.328458 0.457280 0.222802 -0.181365 0.227449 -0.169582 -0.303915 0.275697 0.304023 -0.041403 0.092497
polarizability: 3.33654386e+02 1.64123545e+00 2.35518724e+02 7.30037436e-02 -2.58694786e-01 7.12930043e+01
1716.lowfreq: -1.8259 -0.0008 -0.0008 -0.0007 3.1215 5.4672 18.1457 29.6300 48.8984
frequency: 18.1402 29.6244 48.8788 60.7260 80.2781 118.0219 128.1158 143.0597 152.3423 188.7216 203.3474 209.8214 236.7331 246.3127 259.1122 285.1067 285.9144 293.8524 330.0109 333.5473 363.5209 366.7703 394.8075 418.1291 434.6473 479.5996 481.7936 485.2817 501.8870 506.0537 538.0657 540.3418 559.9898 568.5617 592.6290 600.0266 608.3291 611.5613 644.4783 678.1922 721.5712 737.0923 738.9872 758.2989 760.5406 780.1042 832.7887 858.9544 872.5257 881.2793 923.5915 926.9233 936.5819 982.3177 997.2277 1039.8709 1088.0058 1110.8189 1117.7210 1149.6969 1168.7956 1191.5711 1213.1375 1225.3129 1233.6483 1273.9415 1283.6441 1286.5079 1328.8334 1351.9844 1376.0971 1404.3403 1424.0680 1457.1048 1470.2342 1472.5000 1521.3922 1547.9373 1611.8370 1618.5350 1634.3456 1644.6839 1646.1012 2955.9769 3178.0834 3192.8752 3197.0225 3202.5686 3506.2429 3529.6629 3534.1766 3564.3217 3621.9653
redmass: 7.1555 8.8675 8.5413 11.0724 9.6310 7.0782 7.8002 12.4352 9.5837 8.3883 7.0032 6.7569 4.8525 4.5632 5.0762 1.1924 5.8612 5.8547 9.6381 6.9274 6.0583 7.6271 10.0494 1.1237 9.7224 3.8684 9.9127 1.1000 6.2415 1.2063 7.9834 2.0911 4.5868 6.5114 5.1898 4.0423 5.2168 1.6046 5.2949 7.9113 3.8974 4.8161 7.6841 6.1012 5.9498 7.2546 1.3723 1.6010 1.0963 9.7316 9.2819 1.4131 1.5655 5.6859 4.0662 2.7539 2.3569 1.6956 1.3626 1.9816 1.4210 1.6086 1.5711 2.1666 2.4086 2.2910 1.9483 2.2862 2.4529 2.9141 3.3734 7.1118 6.7691 5.9211 3.5427 4.0866 3.9878 6.5909 4.4243 7.2294 6.7810 8.0533 7.8099 1.0683 1.0928 1.0930 1.0934 1.0925 1.0647 1.0652 1.0642 1.0654 1.0667
irintensity: 1.5405 0.0538 0.1913 1.3936 0.0053 0.0064 2.2878 0.0170 0.3634 2.6478 11.6665 8.1960 2.4590 0.1607 3.8365 155.6765 9.5124 9.3832 4.2079 1.1432 0.0581 18.2548 1.1534 189.7527 0.7405 52.9007 1.8999 111.3333 9.8423 156.4010 1.8928 23.6662 0.1659 37.4706 34.2414 5.1453 68.3909 104.4931 75.9465 6.5200 4.0057 38.8374 3.7494 9.8368 14.4055 15.6166 4.1608 25.5581 206.7794 1.6202 58.4548 5.6271 23.7056 229.2309 171.9349 47.0315 92.7748 55.7672 195.5102 622.0367 17.3558 45.3798 106.0831 0.7561 331.8411 699.5281 4.9551 38.7749 689.4705 55.8611 197.8592 1.4569 11.1701 87.2290 34.1977 80.7712 211.8151 51.3663 14.5501 81.7906 9.5827 98.5791 438.2793 510.2220 4.7026 15.3696 1.1056 4.0452 81.7436 98.5200 50.6628 138.4410 63.2684
temp: 298.150 k
press: 1.00000 atm
elementType: 8 8 8 8 8 8 8 8 8 6 6 6 6 6 6 6 6 6 6 6 6 6 6 1 1 1 1 1 1 1 1 1 1
symmnumber: 1
zpe: 586832.2 jmol-1
zpe.correction: 0.223513 hartree
zpe.thermalcorrener: 0.244186 hartree
zpe.thermalcorrenthalpy: 0.245130 hartree
zpe.thermalcorrgfe: 0.173296 hartree
zpe.sumelectzpe: -1214.876826 hartree
zpe.sumelectthermal: -1214.856153 hartree
zpe.sumelectthermalent: -1214.855209 hartree
zpe.sumelectthermalfe: -1214.927042 hartree
dipole: 5.3256 -2.6209 0.0460
dipole: 5.9358
quadrupole: -139.8201 -117.4744 -134.0892
quadrupole: -9.1307 0.1720 -0.1378
quadrupole: -9.3589 12.9868 -3.6280 -9.1307 0.1720 -0.1378
hfenergy: -1215.1003386 hartree
pointgroup: C01 [X(C14H10O9)]
dipole: 2.1111981 0.9729053 0.22354 debye
polarizability: 333.3948645|-4.4328368|230.0115488|6.1888945|29.757285|77.0597006 unknown
InChI: InChI=1S/C14H10O9/c15-8-2-5(13(20)21)1-7(11(8)18)14(22)23-6-3-9(16)12(19)10(17)4-6/h1-4,15-20H
charge 0 multiplicity 1
33 atoms
O  0.626026 -0.123291 0.04415
O  -2.193312 3.01075 0.574525
O  -4.846721 2.521973 0.406114
O  4.590392 -2.781138 -0.324747
O  5.183859 1.89993 0.517621
O  6.22422 -0.605483 0.100614
O  0.218322 2.148975 0.469303
O  -3.065345 -3.219563 -0.662403
O  -5.283097 -2.532295 -0.589829
C  -1.630811 0.633092 0.127425
C  -2.55956 1.703584 0.310164
C  -2.118944 -0.672615 -0.140166
C  -3.507584 -0.897348 -0.22248
C  2.057985 -0.112936 0.08394
C  -3.962467 1.462933 0.224521
C  -4.432686 0.172537 -0.039719
C  -0.200639 0.962078 0.229946
C  2.849052 1.03979 0.307244
C  2.613833 -1.390887 -0.128734
C  4.014425 -1.529104 -0.118321
C  4.248067 0.86447 0.310659
C  4.835853 -0.398442 0.1019
C  -4.064679 -2.245146 -0.500353
H  -1.419026 -1.497537 -0.28151
H  -5.507181 -0.020041 -0.106698
H  2.385797 2.014004 0.469552
H  1.9746 -2.259138 -0.298334
H  -1.168655 3.043648 0.608105
H  -4.324061 3.350675 0.580121
H  5.579561 -2.69729 -0.283113
H  4.745211 2.772606 0.659105
H  6.689611 0.254113 0.265608
H  -3.501447 -4.094502 -0.844309
