program: Gaussian 09
title: 000097349
version: EM64L-G09RevD.01
frameworkgroup: C1[X(C7H13N3O3)]
method: RPBEPBE
basis: SDD
operation: Freq
keyword: #p
keyword: freq=noraman
keyword: PBEPBE/SDD
title: #p freq=noraman PBEPBE/SDD
converged: YES YES NO NO
title: Mulliken charges:
elementType: O O O N N N C C C C C C C H H H H H H H H H H H H H
charge: -0.234534 -0.273468 -0.244257 -0.404329 -0.161033 0.032225 -0.075847 -0.449957 -0.403503 -0.318257 -0.316623 0.340804 -0.625328 0.272871 0.228213 0.219650 0.238670 0.219190 0.176402 0.230253 0.227280 0.190530 0.342415 0.256469 0.275957 0.256206
chargesum: 0.00000
title: Mulliken charges with hydrogens summed into heavy atoms:
elementType: O O O N N N C C C C C C C
charge: -0.234534 -0.273468 -0.244257 -0.061914 -0.161033 0.032225 0.197024 -0.002094 0.054358 0.088398 0.101186 0.340804 0.163303
polarizability: 1.28120497e+02 5.36696066e+00 1.13299184e+02 5.97018256e+00 -1.34361850e+00 8.05782113e+01
1716.lowfreq: -11.8210 -0.0008 -0.0005 -0.0004 7.7752 10.5366 24.9640 56.5626 81.7167
frequency: 24.5270 56.5367 81.6542 96.6692 136.1734 160.7730 188.0771 221.3661 235.9196 289.0140 317.9934 366.5055 380.0343 393.9870 438.6109 467.7169 491.1093 508.3177 650.7913 662.2092 710.2876 745.7209 785.6992 798.3699 818.3698 860.8955 875.7915 926.3454 959.4498 1006.4938 1012.8912 1030.7151 1036.6393 1114.4266 1117.0402 1120.7365 1151.7892 1171.1569 1190.0260 1195.6846 1252.7488 1265.6911 1278.4440 1304.3978 1333.8382 1340.3123 1347.8253 1359.5808 1362.1322 1379.1450 1413.6685 1441.4544 1454.4133 1462.5567 1462.7558 1465.7632 1471.6285 1488.3215 1661.5727 2910.3144 2938.6759 2997.5197 3001.1994 3005.1620 3028.7822 3063.0815 3067.2771 3077.3730 3082.8060 3090.1338 3146.7047 3495.8028
redmass: 4.5897 5.1144 4.3649 4.7880 1.1031 4.6641 3.9251 2.8986 6.0921 3.4362 3.1954 2.0941 3.1076 5.2190 4.1741 5.1983 4.7525 2.5879 1.1134 2.4803 8.6907 5.2656 4.1705 1.6076 4.7691 3.3607 2.8002 2.7251 2.8054 1.9607 1.5685 2.9893 2.3734 2.6451 1.3357 2.0329 2.3595 1.1909 1.5040 2.2623 1.3529 2.3161 1.3937 1.5680 1.4729 1.3132 1.3529 8.1670 1.3291 1.2865 1.1873 1.0907 1.0975 1.0460 1.0966 1.1869 1.0729 1.6490 10.0890 1.0709 1.0694 1.0625 1.0612 1.0335 1.0851 1.1002 1.1012 1.0933 1.0960 1.1009 1.1011 1.0772
irintensity: 0.1424 0.5675 0.2545 13.3998 0.7944 4.3479 4.5889 3.3650 15.2399 10.1875 9.7676 6.0926 4.6142 1.9915 1.9365 4.4226 1.2365 6.3182 85.6030 8.8424 14.9744 37.8683 6.0290 0.4407 14.0061 18.4514 30.7671 162.4384 58.7086 4.7467 4.0161 56.7527 12.8225 27.8517 0.9904 0.8705 63.4380 4.3892 39.9616 4.9581 15.7494 8.6798 6.1078 10.5323 15.1242 12.2062 3.1623 141.7149 2.5725 0.8260 36.4567 23.2310 30.2352 22.4120 15.4076 83.8314 3.8904 397.5853 228.7598 68.2180 68.9352 20.2934 17.0818 13.5384 24.9708 25.2135 31.9772 35.8985 40.9362 13.0854 0.2438 37.9010
temp: 298.150 k
press: 1.00000 atm
elementType: 8 8 8 7 7 7 6 6 6 6 6 6 6 1 1 1 1 1 1 1 1 1 1 1 1 1
symmnumber: 1
zpe: 551763.2 jmol-1
zpe.correction: 0.210155 hartree
zpe.thermalcorrener: 0.223256 hartree
zpe.thermalcorrenthalpy: 0.224201 hartree
zpe.thermalcorrgfe: 0.169496 hartree
zpe.sumelectzpe: -663.385208 hartree
zpe.sumelectthermal: -663.372107 hartree
zpe.sumelectthermalent: -663.371163 hartree
zpe.sumelectthermalfe: -663.425867 hartree
dipole: -0.3096 -0.8031 -0.9920
dipole: 1.3134
quadrupole: -82.3698 -88.0924 -73.4175
quadrupole: -3.4902 4.7573 -4.0569
quadrupole: -1.0766 -6.7992 7.8757 -3.4902 4.7573 -4.0569
hfenergy: -663.5953633 hartree
pointgroup: C01 [X(C7H13N3O3)]
dipole: 0.1247775 -0.3680223 0.340562 debye
dipolederiv: -0.4521959 -0.0678306 -0.0126205 -0.0803712 -0.5725541 -0.1191542 -0.0018588 -0.1166756 -0.7480664 -0.7272529 0.0485604 -0.0346235 -0.1921019 -0.9988823 -0.0769826 -0.0774447 -0.0602352 -0.366222 -0.6648237 0.7677394 0.0267238 0.2116782 -0.7227745 -0.0395871 -0.0661491 0.0843188 -0.1911442 -1.4190779 -0.0719526 -0.0891984 -0.3192113 -0.4502023 -0.082873 -0.1979687 -0.0632352 -0.4881105 -0.6673933 0.236369 -0.0539949 0.7752887 -1.1089717 -0.0043801 -0.0118746 -0.0737118 -0.1213039 0.0989886 -0.5311143 -0.0410423 -0.5984564 1.2876828 0.0744504 -0.0420372 0.0562738 -0.0482639 0.7629006 -0.0710754 -0.0079697 -0.2502522 0.1632572 -0.0159853 0.0458671 0.024689 0.2703896 0.0002139 -0.0132274 0.0438856 -0.0343061 -0.0201245 0.0385739 0.0165956 0.00426 -0.0026554 -0.0434062 -0.0793727 -0.0213796 -0.0415821 -0.0241314 0.0066244 0.0374587 -0.0111226 -0.0744226 0.3485798 -0.115525 -0.1456663 -0.0854448 0.3675791 0.0189376 -0.0894396 0.0843914 0.5461765 0.3940185 0.0870354 0.2262549 0.1072277 0.4234074 0.1012694 0.1038578 0.0654067 0.4252868 2.0662238 -0.3428392 0.1887187 0.0882644 1.3803148 0.1106765 0.3354294 0.0635452 0.3259168 0.1880164 -0.0182201 -0.0110699 0.1205762 0.030193 -0.0041799 0.011741 -0.0226131 0.2021467 -0.0243754 -0.0639274 0.0405974 0.0211947 -0.0494089 0.0909675 0.0198183 0.0537152 0.0071024 -0.0908369 0.0700169 -0.0755019 0.0608446 -0.0175977 0.0549548 -0.0369342 0.0244815 0.0861433 0.0514749 0.0242038 0.1300621 0.004479 0.039671 -0.0696703 0.090677 -0.0565408 -0.1143444 0.0335447 -0.0984959 -0.0952855 -0.0740911 0.0179717 -0.0644631 -0.0789218 -0.0434573 -0.0067551 -0.0972251 0.1239443 -0.0100567 0.0997237 -0.0042003 0.0453702 0.0131175 0.0708979 0.0526699 -0.1397754 0.1863944 0.0431043 0.1339605 -0.0477919 0.0182063 -0.038615 0.0478423 -0.0314508 -0.0463284 -0.1119057 -0.0721092 -0.0763727 0.0057565 -0.0661112 -0.054561 -0.0827836 -0.0149486 -0.0037149 -0.0019012 0.1093481 -0.005199 0.0583391 -0.0578189 0.0856949 -0.0427504 -0.1069483 -0.1177997 0.069476 -0.1534366 0.1056173 -0.0761167 0.0414844 -0.0624645 -0.0092845 0.0265569 0.3342516 -0.0230517 -0.0110716 -0.0150541 0.1702565 -0.0159319 -0.033134 -0.0035899 0.2821599 -0.0103462 -0.0253011 0.0497983 0.0419297 0.0806284 -0.0583421 0.0886735 -0.0175817 -0.0145836 0.1885622 0.0452017 0.0115291 -0.0306374 0.012875 -0.0217773 0.0051517 -0.0085031 0.138413 0.0377771 -0.023201 -0.0349957 0.0322957 0.0548237 0.0957416 -0.0626794 0.0322629 -0.0337418 unknown
polarizability: 128.2194801|-6.0418509|112.1290545|5.0954261|6.008663|81.6493575 unknown
InChI: InChI=1S/C7H13N3O3/c1-10(9-12)7(11)8-6-2-4-13-5-3-6/h6,8H,2-5H2,1H3
charge 0 multiplicity 1
26 atoms
O  3.37054 0.88218 -0.614962
O  -1.222494 -2.09815 -0.07721
O  -3.271316 2.022764 0.025472
N  -0.021402 -0.145306 0.413477
N  -2.348901 -0.023892 -0.041534
N  -2.192429 1.34505 0.152476
C  1.282935 -0.822688 0.605659
C  2.217877 0.082422 1.444104
C  1.958583 -1.167704 -0.751134
C  2.710851 1.298812 0.629937
C  2.450909 0.102997 -1.466917
C  -1.148583 -0.849845 0.093648
C  -3.651468 -0.627618 -0.36505
H  1.079083 -1.764277 1.147003
H  3.096031 -0.517702 1.744409
H  1.70914 0.41889 2.368161
H  1.248581 -1.724732 -1.3897
H  2.821931 -1.830101 -0.550234
H  1.870625 1.993597 0.393742
H  3.474159 1.865944 1.18718
H  3.036554 -0.141822 -2.367757
H  1.58907 0.741699 -1.765244
H  -0.113988 0.870026 0.517681
H  -4.375212 -0.417862 0.441407
H  -3.492682 -1.709815 -0.47217
H  -4.045694 -0.195365 -1.300844
