program: Gaussian 09
title: 000097338
version: EM64L-G09RevD.01
frameworkgroup: C1[X(C15H10N4)]
method: RPBEPBE
basis: SDD
operation: Freq
keyword: #pfreq=noraman
keyword: PBEPBE/SDD
title: #p freq=noraman PBEPBE/SDD
converged: YES YES NO NO
title: Mulliken charges:
elementType: N N N N C C C C C C C C C C C C C C C H H H H H H H H H H
charge: -0.296778 -0.024673 -0.116449 -0.093176 0.198783 0.268286 -0.053495 0.116356 0.350220 -0.361408 -0.381944 -0.248923 -0.218186 -0.208002 -0.405429 -0.374869 -0.231621 -0.226998 -0.233902 0.272952 0.279726 0.237366 0.240492 0.286510 0.266466 0.256650 0.233540 0.233504 0.235003
chargesum: 0.00000
title: Mulliken charges with hydrogens summed into heavy atoms:
elementType: N N N N C C C C C C C C C C C C C C C
charge: -0.296778 -0.024673 -0.116449 -0.093176 0.198783 0.268286 -0.053495 0.116356 0.350220 -0.088456 -0.102217 -0.011556 0.022306 0.078508 -0.138963 -0.118219 0.001918 0.006505 0.001101
polarizability: 2.66014100e+02 9.46665552e+00 2.24619691e+02 -2.98652883e+00 9.79278741e+00 9.19251393e+01
1716.lowfreq: -5.5794 -0.0005 -0.0002 0.0003 4.1796 9.6810 53.1808 64.9719 81.6665
frequency: 53.1400 64.9398 81.6601 119.0334 140.0141 211.3776 220.3597 277.1951 282.9940 287.9432 393.4775 404.6806 425.8748 437.8639 473.4965 491.1052 510.2307 588.6250 614.6389 632.9255 639.4407 665.2983 674.4886 701.0699 703.5818 735.4853 754.4776 772.7796 781.7379 788.8911 800.1415 857.2127 899.1806 904.3825 925.7967 930.2772 949.6808 975.0820 985.0679 989.5119 999.8723 1007.6977 1021.4246 1028.7941 1052.6482 1085.9126 1105.9723 1129.9990 1164.3559 1175.3763 1183.2159 1192.8440 1210.9603 1239.9855 1282.7051 1306.9526 1322.7608 1348.6683 1375.3822 1378.7045 1394.7039 1419.9136 1435.8449 1454.5353 1464.2125 1489.0079 1548.5991 1566.9054 1586.8552 1612.1215 1623.9894 3129.3962 3137.4894 3140.4788 3149.2792 3155.5029 3159.7813 3170.0708 3171.5740 3178.1333 3270.6050
redmass: 4.3527 5.2446 4.9769 5.1367 5.5179 5.7069 5.5369 5.3744 6.0859 5.7405 6.7976 2.9163 4.6939 5.1448 7.3318 4.0495 3.9271 6.8154 6.3582 6.2713 5.3041 4.4202 5.8988 3.2195 2.1891 6.6988 2.9435 1.6825 2.1747 1.7513 3.1924 1.2520 1.4702 6.8528 6.6985 1.6691 5.0679 1.3861 1.4284 5.1516 1.3238 1.3446 3.7215 2.2289 2.5159 1.6013 2.3886 2.0361 1.8201 1.0533 1.1741 1.1211 4.4336 3.0800 3.6165 2.1107 1.6387 3.3242 4.4773 5.0960 8.4389 3.3120 2.5466 3.5524 3.0643 2.7122 6.7119 7.2033 6.2092 6.1153 6.8118 1.0851 1.0881 1.0865 1.0930 1.0906 1.0963 1.0955 1.1007 1.0999 1.1005
irintensity: 0.0919 0.7935 0.5553 0.3559 4.8235 1.8371 0.5116 1.6056 2.2270 1.2122 3.8233 0.5000 1.8626 1.4813 3.2811 3.2185 2.9709 16.3491 0.7182 3.4756 3.3285 19.4662 6.7101 49.4619 22.2269 25.3505 15.3957 0.0732 9.7753 80.4950 11.6229 2.3977 1.0740 12.3810 1.8350 4.4238 4.8357 1.1660 2.2262 1.1225 0.0018 0.4300 5.2408 8.3555 4.3337 10.1444 10.2387 38.3525 1.3210 0.0037 2.9410 3.2826 1.7212 40.5087 9.9528 18.6489 10.3688 23.9545 9.3215 15.6901 33.1083 4.2845 26.2406 35.7155 8.3608 0.3394 5.8233 5.7842 1.4531 1.4698 14.8609 1.7676 2.5922 2.7104 26.0588 8.2944 19.2484 1.2653 20.1393 16.3514 2.4240
temp: 298.150 k
press: 1.00000 atm
elementType: 7 7 7 7 6 6 6 6 6 6 6 6 6 6 6 6 6 6 6 1 1 1 1 1 1 1 1 1 1
symmnumber: 1
zpe: 568336.2 jmol-1
zpe.correction: 0.216468 hartree
zpe.thermalcorrener: 0.229820 hartree
zpe.thermalcorrenthalpy: 0.230765 hartree
zpe.thermalcorrgfe: 0.175924 hartree
zpe.sumelectzpe: -795.290825 hartree
zpe.sumelectthermal: -795.277472 hartree
zpe.sumelectthermalent: -795.276528 hartree
zpe.sumelectthermalfe: -795.331369 hartree
dipole: 5.8782 3.7586 -0.5287
dipole: 6.9971
quadrupole: -119.8834 -97.8097 -109.8524
quadrupole: -12.8347 1.2590 3.8994
quadrupole: -10.7016 11.3721 -0.6706 -12.8347 1.2590 3.8994
hfenergy: -795.5072929 hartree
pointgroup: C01 [X(C15H10N4)]
dipole: -2.3517273 1.4246599 -0.1343978 debye
polarizability: 266.5037958|-8.1050091|213.9912165|1.657828|-36.6481452|102.0639182 unknown
InChI: InChI=1S/C15H10N4/c1-2-6-11(7-3-1)14-12-8-4-5-9-13(12)15-17-16-10-19(15)18-14/h1-10H
charge 0 multiplicity 1
29 atoms
N  1.503881 -1.555863 0.332545
N  0.114055 -1.530273 0.329539
N  3.662859 -0.906584 0.138472
N  3.61514 -2.307577 0.418487
C  0.353953 0.910622 -0.081377
C  1.792137 0.825326 -0.116922
C  -0.434008 -0.322438 0.107362
C  2.37715 -0.475162 0.091208
C  -1.927623 -0.340809 0.073868
C  -0.242702 2.202681 -0.177977
C  2.586448 1.986303 -0.304111
C  0.551459 3.347532 -0.355761
C  1.967223 3.239277 -0.434601
C  2.316033 -2.665644 0.526216
C  -2.654795 0.296717 -0.967185
C  -2.638198 -1.06757 1.065602
C  -4.063824 0.220451 -1.003443
C  -4.046601 -1.136395 1.03106
C  -4.765133 -0.489184 -0.001403
H  -1.32738 2.304475 -0.089812
H  3.674827 1.878069 -0.329198
H  0.076544 4.331672 -0.425803
H  2.575734 4.138366 -0.577502
H  1.936758 -3.661678 0.72841
H  -2.120122 0.816067 -1.769808
H  -2.075391 -1.574282 1.855785
H  -4.612058 0.7060 -1.818043
H  -4.582486 -1.694012 1.806678
H  -5.858981 -0.542188 -0.028686
