program: Gaussian 09
title: 000097320
version: EM64L-G09RevD.01
frameworkgroup: C1[X(C18H22N2)]
method: RPBEPBE
basis: SDD
operation: Freq
keyword: #pfreq=noraman
keyword: PBEPBE/SDD
title: #p freq=noraman PBEPBE/SDD
converged: YES YES NO NO
title: Mulliken charges:
elementType: N N C C C C C C C C C C C C C C C C C C H H H H H H H H H H H H H H H H H H H H H H
charge: -0.113543 -0.113553 -0.238682 -0.238682 0.559653 0.559647 -0.689953 -0.690107 -0.689899 -0.690151 -0.438801 -0.438805 -0.384069 -0.384068 0.155402 0.155410 -0.293114 -0.293104 -0.370286 -0.370294 0.210995 0.210996 0.211477 0.213543 0.228893 0.228912 0.213579 0.211327 0.211445 0.213564 0.228892 0.228914 0.213557 0.211350 0.232860 0.232862 0.232599 0.232594 0.272666 0.272667 0.246653 0.246654
chargesum: 0.00000
title: Mulliken charges with hydrogens summed into heavy atoms:
elementType: N N C C C C C C C C C C C C C C C C C C
charge: -0.113543 -0.113553 -0.027687 -0.027686 0.559653 0.559647 -0.036040 -0.036289 -0.035998 -0.036330 -0.205941 -0.205943 -0.151470 -0.151474 0.155402 0.155410 -0.020448 -0.020438 -0.123633 -0.123640
polarizability: 4.94063126e+02 4.44328063e+00 1.86443690e+02 -3.83739038e-04 5.65088189e-02 1.21525230e+02
1716.lowfreq: -18.2360 -7.9008 -1.5993 -0.0009 0.0009 0.0014 7.8927 24.6702 36.9141
frequency: 7.8908 24.6702 36.8358 43.1580 48.8943 67.8686 121.2464 147.5219 147.9233 155.9802 198.3663 214.6066 214.7871 247.2353 248.2432 254.6406 267.1756 287.7110 309.6760 332.8325 390.9466 405.3545 415.2880 430.7438 448.1130 471.5602 506.2876 538.7475 542.7137 577.6698 595.2318 628.3104 634.5862 698.1892 742.6558 747.5921 761.9447 823.7960 845.0280 845.0876 856.7651 864.2227 888.4958 888.5215 901.7667 918.0026 918.0250 954.8640 954.8749 972.5388 974.3444 990.4008 990.8972 1001.2304 1001.4319 1049.2995 1049.9504 1101.6443 1104.6486 1110.1880 1110.1978 1137.8537 1152.5916 1152.6261 1158.2243 1190.9956 1216.3298 1217.3910 1238.9942 1284.3358 1286.1531 1305.9130 1305.9291 1319.4076 1322.3115 1355.6994 1376.8512 1376.8607 1387.2142 1391.2473 1395.6243 1396.4974 1417.3590 1423.4933 1466.1062 1466.1116 1468.2099 1468.2168 1475.3282 1478.1604 1478.4574 1480.7703 1491.0870 1493.8520 1569.8628 1573.8507 1609.2340 1610.2775 2974.6259 2974.6380 2977.3026 2977.4527 2981.0117 2981.0502 3067.8876 3067.9029 3075.2454 3075.3822 3078.5675 3078.5841 3082.8102 3082.8185 3119.7148 3119.8762 3126.7374 3126.9063 3157.1821 3157.2848 3164.3640 3164.6168
redmass: 2.8670 4.3084 3.2923 4.6160 3.2870 3.7398 4.0046 3.9230 4.9098 4.0918 2.4188 1.0531 1.0398 1.0918 5.0705 1.1745 4.2746 2.9662 3.1838 2.9137 4.1231 2.9447 3.1732 3.1805 4.8810 3.0102 5.2409 3.5776 2.4831 2.3365 3.2119 6.5919 7.0916 3.4434 4.3756 3.5214 3.6679 6.1710 1.3141 1.2652 1.4964 1.6429 2.5711 2.5616 7.3694 1.1772 1.1774 1.4685 1.4687 1.3644 1.3786 1.3621 1.3690 2.7195 2.7710 1.5744 1.5312 1.4165 1.4088 2.5741 2.5737 2.3029 1.7671 1.7604 1.2665 1.4950 1.8171 1.9556 3.5102 1.4880 1.5628 1.3220 1.3219 1.9171 1.8680 5.9728 1.1917 1.1917 3.0778 2.6745 1.2457 1.4638 3.1883 3.1419 1.0482 1.0482 1.0470 1.0470 1.7457 1.0670 1.0673 1.4239 1.2688 1.5710 6.6179 6.8489 6.4541 6.3938 1.0348 1.0348 1.0353 1.0354 1.0842 1.0841 1.1002 1.1002 1.0993 1.0993 1.1006 1.1006 1.0998 1.0998 1.0893 1.0892 1.0881 1.0881 1.0954 1.0954 1.0943 1.0943
irintensity: 0.0805 0.8014 0.0000 1.1014 0.0084 0.0000 0.0249 0.0000 0.0001 0.0000 0.2842 0.0010 0.0452 0.0000 0.0000 0.1524 1.8717 1.3680 0.0001 0.0000 0.0002 0.3762 0.0002 8.4109 2.5365 0.0000 5.2180 20.0685 0.0144 55.8715 0.0013 0.0000 5.4786 0.7500 0.0000 0.0002 0.3134 0.4683 0.0002 6.6185 0.0001 101.3586 7.6062 0.4014 0.0000 2.3247 5.4117 0.0788 0.0011 0.0001 2.9737 0.0002 0.7982 23.7939 0.0014 0.0006 116.1293 0.0001 37.2444 0.1596 1.8503 0.0000 0.1168 0.0014 77.3115 0.0000 4.3122 0.0000 34.7970 18.3577 0.0000 0.9287 0.4836 24.2746 0.0001 0.0001 12.0451 17.9661 2.4114 0.0007 19.4686 0.0006 16.3371 0.0001 3.5270 9.1717 0.0001 0.1154 0.0002 25.5703 0.0040 12.5533 0.0001 47.8472 5.1368 0.0001 0.0004 118.7057 4.2376 57.2045 109.3453 0.1053 41.1138 0.4573 0.1550 0.1378 237.6574 0.6708 0.1579 48.7233 83.4318 0.3805 50.3564 0.0702 52.6230 0.0121 27.3941 0.1295 12.1537 0.0023
temp: 298.150 k
press: 1.00000 atm
elementType: 7 7 6 6 6 6 6 6 6 6 6 6 6 6 6 6 6 6 6 6 1 1 1 1 1 1 1 1 1 1 1 1 1 1 1 1 1 1 1 1 1 1
symmnumber: 1
zpe: 924598.6 jmol-1
zpe.correction: 0.352161 hartree
zpe.thermalcorrener: 0.372324 hartree
zpe.thermalcorrenthalpy: 0.373269 hartree
zpe.thermalcorrgfe: 0.300570 hartree
zpe.sumelectzpe: -807.126805 hartree
zpe.sumelectthermal: -807.106642 hartree
zpe.sumelectthermalent: -807.105697 hartree
zpe.sumelectthermalfe: -807.178396 hartree
dipole: -0.0002 -0.0001 -0.0002
dipole: 0.0003
quadrupole: -87.9625 -111.3701 -125.8886
quadrupole: -1.4099 0.0018 0.0180
quadrupole: 20.4445 -2.9630 -17.4815 -1.4099 0.0018 0.0180
hfenergy: -807.478966 hartree
pointgroup: C01 [X(C18H22N2)]
dipole: -0.000071 0.0000745 -0.0000296 debye
polarizability: 494.1017195|-0.1459885|121.5486613|2.8016517|-1.2334301|186.3816651 unknown
InChI: InChI=1S/C18H22N2/c1-13(2)15-5-9-17(10-6-15)19-20-18-11-7-16(8-12-18)14(3)4/h5-14H,1-4H3
charge 0 multiplicity 1
42 atoms
N  -0.402703 -0.106941 -0.504109
N  0.405346 -0.126351 0.52707
C  -6.13131 -0.122858 0.479981
C  6.133938 -0.107469 -0.457203
C  -4.619714 -0.118778 0.245688
C  4.622343 -0.111685 -0.22286
C  -6.797654 -1.391891 -0.117724
C  -6.799274 1.163636 -0.076796
C  6.7994 -1.399954 0.088872
C  6.802814 1.155123 0.150933
C  -3.715493 -0.139105 1.344054
C  3.718077 -0.089502 -1.321153
C  -4.078297 -0.095196 -1.067771
C  4.080976 -0.138527 1.090556
C  -1.794841 -0.112514 -0.169683
C  1.797495 -0.120198 0.192604
C  -2.322601 -0.136208 1.151894
C  2.325192 -0.093568 -1.128944
C  -2.686341 -0.092099 -1.275379
C  2.689023 -0.142586 1.298215
H  -6.300026 -0.140508 1.575652
H  6.302606 -0.081104 -1.552706
H  -6.674141 -1.425767 -1.216156
H  -7.881713 -1.398025 0.10066
H  -6.353299 -2.312621 0.300906
H  -6.354678 2.071171 0.369486
H  -7.882905 1.162392 0.143756
H  -6.678121 1.231908 -1.173874
H  6.677956 -1.476879 1.185349
H  7.883021 -1.399115 -0.131733
H  6.352886 -2.302845 -0.364847
H  6.360303 2.080219 -0.259957
H  7.886859 1.160877 -0.067543
H  6.679711 1.180238 1.249647
H  -4.120696 -0.157294 2.363639
H  4.12322 -0.068769 -2.340712
H  -4.750104 -0.078931 -1.933858
H  4.75281 -0.156446 1.956591
H  -1.625886 -0.151663 1.995624
H  1.628431 -0.076542 -1.972607
H  -2.257848 -0.074016 -2.283133
H  2.260638 -0.162908 2.30597
