program: Gaussian 09
title: 000097332
version: EM64L-G09RevD.01
frameworkgroup: C1[X(C20H20O7)]
method: RPBEPBE
basis: SDD
operation: Freq
keyword: #pfreq=noraman
keyword: PBEPBE/SDD
title: #p freq=noraman PBEPBE/SDD
converged: YES YES NO NO
title: Mulliken charges:
elementType: O O O O O O O C C C C C C C C C C C C C C C C C C C C H H H H H H H H H H H H H H H H H H H H
charge: -0.294551 -0.309511 -0.276643 -0.258315 -0.286914 -0.304972 -0.292210 0.064239 0.265623 0.123669 0.087141 0.333563 0.112856 0.253531 -0.569088 0.386824 -0.548804 -0.502118 -0.376028 0.227503 0.179606 -0.342182 -0.516027 -0.524091 -0.535095 -0.530059 -0.530228 0.287872 0.271107 0.285296 0.301064 0.251361 0.227427 0.279140 0.211077 0.227293 0.205740 0.289371 0.230512 0.249251 0.224661 0.224422 0.249388 0.231662 0.226368 0.258843 0.230425
chargesum: 0.00000
title: Mulliken charges with hydrogens summed into heavy atoms:
elementType: O O O O O O O C C C C C C C C C C C C C C C C C C C C
charge: -0.294551 -0.309511 -0.276643 -0.258315 -0.286914 -0.304972 -0.292210 0.064239 0.265623 0.123669 0.087141 0.333563 0.112856 0.253531 -0.281216 0.386824 -0.277697 -0.216821 -0.074964 0.227503 0.179606 -0.090822 0.201618 0.198313 0.169329 0.175413 0.185408
polarizability: 4.36482537e+02 -7.21355396e+00 3.04604251e+02 -7.16114148e+00 -2.88395845e+00 1.32343683e+02
1716.lowfreq: -6.0078 -5.4227 -3.5195 -0.0007 -0.0005 0.0004 17.1134 26.8332 45.0662
frequency: 16.8285 26.8170 45.0527 51.3158 59.1198 64.3307 86.1757 98.1983 104.3903 110.5274 120.8804 127.9302 143.1242 151.1641 157.7829 160.7787 171.0658 188.4363 199.4339 205.0872 221.7627 242.4638 245.2378 247.7108 272.5589 279.5357 292.8094 316.0320 326.8115 355.0648 361.6175 388.8126 412.2475 436.1956 442.6371 456.9482 489.8880 496.5716 553.2473 560.8024 565.4609 583.2317 591.3758 608.1592 627.1288 642.3501 667.9160 677.2780 701.6443 715.9192 750.8302 775.2534 791.8183 843.3865 850.1117 851.5000 858.5804 884.3642 911.7092 922.2234 924.3567 945.6180 962.4596 980.3280 994.6696 1031.2092 1052.2231 1090.3318 1099.3202 1105.8839 1110.2465 1112.2771 1112.6450 1112.9604 1140.5456 1144.6695 1151.6273 1152.3138 1155.0801 1164.3128 1172.9027 1184.0948 1198.0799 1222.6343 1250.4234 1268.7072 1296.6576 1325.4375 1364.2734 1379.1307 1397.8252 1403.4329 1414.1434 1420.7461 1423.2437 1439.1098 1440.3461 1450.0445 1452.5936 1456.5215 1459.1894 1466.2892 1467.8900 1475.8085 1476.0394 1481.8585 1484.1158 1486.2129 1487.6761 1525.3895 1553.0330 1555.9111 1577.6571 1608.3185 1625.4572 2969.2550 2970.3934 2977.6676 2978.1904 2982.8667 3061.4253 3064.9390 3076.2192 3091.0506 3096.5000 3120.5970 3124.7269 3125.5089 3131.9796 3135.3403 3158.2748 3183.7542 3184.3917 3193.9657 3202.7851
redmass: 4.4038 4.9422 3.8981 3.7466 4.6330 3.4633 1.8983 2.7798 2.6724 2.5820 2.7502 1.8668 1.2990 1.6489 2.5858 1.7043 1.9303 4.4789 2.0565 2.7964 3.9067 3.0794 3.1754 4.9393 5.9518 4.0156 5.1268 4.8967 6.4422 4.6907 6.8774 5.1189 7.0255 6.1578 6.2724 6.4930 3.6071 5.3519 6.4611 7.8773 7.5354 5.8977 5.3659 6.2179 4.5115 6.0675 4.3535 5.3028 4.5158 5.8409 3.4956 6.7249 7.0298 1.4760 2.4447 2.3424 1.8899 7.2752 3.8548 1.9710 8.4559 8.7825 8.6621 1.3434 3.6744 2.7598 7.4003 2.8717 2.7386 1.3020 1.2653 1.2489 1.2577 1.2506 1.8929 1.4717 1.3932 1.3874 1.3669 1.6653 2.2153 2.7504 2.0656 2.0462 1.8768 3.7483 4.7397 4.9809 5.1578 4.1314 3.1739 4.7592 1.2651 1.3431 1.1824 1.3307 1.2776 1.1626 1.0821 1.0564 1.0726 1.3997 1.2547 1.1935 1.2637 2.6372 1.0943 1.1088 1.0550 5.1451 6.9940 8.8447 9.3076 6.6464 7.7202 1.0325 1.0307 1.0309 1.0321 1.0333 1.1043 1.1044 1.1037 1.0997 1.0985 1.1023 1.1052 1.1033 1.1003 1.1056 1.0907 1.0911 1.0909 1.0933 1.0944
irintensity: 0.2482 0.8083 3.9652 1.9214 0.3629 0.9572 0.8092 5.6489 1.9021 19.3253 1.7609 1.6594 0.4661 5.5294 1.7259 0.7293 0.7685 0.3249 7.7787 9.2925 3.8525 5.8403 0.4063 7.0794 5.6127 5.8745 4.6895 3.1317 3.7046 0.7170 4.3828 1.8951 5.0507 2.8661 9.2144 6.3404 8.0892 5.6322 2.4589 10.5825 18.5885 14.7757 2.8401 22.3680 9.3365 4.3772 1.3910 9.9182 13.8488 25.6892 11.1272 4.8240 11.6258 3.7705 33.9207 31.3431 74.2671 1.9615 7.5076 50.2357 7.8184 95.1544 35.0286 3.4350 96.0126 14.0858 66.7543 54.8488 41.0206 12.1416 32.5479 20.7958 0.5458 7.1613 214.0202 15.0555 5.8441 23.2998 16.8648 46.3754 287.1698 108.5988 16.3527 68.3471 165.4256 42.2113 221.4199 222.6957 16.8355 112.5023 56.7492 35.6237 126.2447 8.2286 0.5281 9.6285 93.4327 13.9354 9.6201 13.2115 16.9202 53.6722 26.2356 63.6536 39.8041 109.2524 73.8390 96.0058 20.5792 96.3803 43.2307 170.9160 259.9160 35.9553 426.7502 78.6168 71.0395 113.0008 46.0399 93.1046 40.4477 28.8622 23.2093 37.3868 37.0499 25.0419 12.9285 25.2995 22.2111 8.1560 7.0874 0.8188 2.3308 0.7336 6.7159
temp: 298.150 k
press: 1.00000 atm
elementType: 8 8 8 8 8 8 8 6 6 6 6 6 6 6 6 6 6 6 6 6 6 6 6 6 6 6 6 1 1 1 1 1 1 1 1 1 1 1 1 1 1 1 1 1 1 1 1
symmnumber: 1
zpe: 942488.3 jmol-1
zpe.correction: 0.358975 hartree
zpe.thermalcorrener: 0.386088 hartree
zpe.thermalcorrenthalpy: 0.387032 hartree
zpe.thermalcorrgfe: 0.300486 hartree
zpe.sumelectzpe: -1298.626728 hartree
zpe.sumelectthermal: -1298.599615 hartree
zpe.sumelectthermalent: -1298.598671 hartree
zpe.sumelectthermalfe: -1298.685217 hartree
dipole: 0.1238 -2.0373 3.0874
dipole: 3.7011
quadrupole: -126.0398 -146.6147 -154.3633
quadrupole: 8.1528 -8.7783 6.1266
quadrupole: 16.2995 -4.2754 -12.0241 8.1528 -8.7783 6.1266
hfenergy: -1298.985703 hartree
pointgroup: C01 [X(C20H20O7)]
dipole: 0.0425822 0.2756906 -1.4291388 debye
polarizability: 434.2696385|20.8167963|279.1441434|10.622605|-62.568381|160.0166898 unknown
InChI: InChI=1S/C20H20O7/c1-22-12-9-15(25-4)17-16(10-12)27-19(20(26-5)18(17)21)11-6-7-13(23-2)14(8-11)24-3/h6-10H,1-5H3
charge 0 multiplicity 1
47 atoms
O  -0.294996 0.583073 -0.138768
O  0.42167 -2.699534 1.349661
O  -4.849618 -1.424809 0.132795
O  -4.112918 3.131866 -1.253446
O  -2.398457 -2.604129 1.452658
O  4.171977 2.134406 -1.369428
O  6.064863 0.414174 0.078171
C  -2.469875 -0.561126 0.120319
C  -1.691959 0.585242 -0.24868
C  0.411606 -0.540877 0.323539
C  -0.302726 -1.643476 0.786739
C  1.86734 -0.321851 0.259425
C  -1.785804 -1.671896 0.81727
C  -3.892493 -0.434895 -0.082373
C  -2.231766 1.794876 -0.704154
C  -3.634435 1.897163 -0.813278
C  -4.457035 0.783205 -0.521202
C  2.367552 0.775056 -0.501058
C  2.80337 -1.165167 0.928433
C  3.745577 1.02886 -0.591686
C  4.671459 0.208174 0.119551
C  4.182113 -0.893857 0.854606
C  0.035245 -4.084429 0.983739
C  -4.617256 -2.816796 -0.304665
C  -5.566523 3.303614 -1.364391
C  4.967281 1.763082 -2.563048
C  6.530062 1.736956 0.562949
H  -1.585306 2.639032 -0.949936
H  -5.541094 0.805689 -0.65198
H  1.684532 1.434826 -1.041014
H  2.436879 -2.006792 1.51652
H  4.906799 -1.519494 1.385088
H  0.803462 -4.716322 1.454939
H  -0.966916 -4.312576 1.376302
H  0.063054 -4.211684 -0.115061
H  -5.627007 -3.234493 -0.441693
H  -4.066432 -2.834301 -1.264462
H  -4.053036 -3.359684 0.468391
H  -6.063254 3.14527 -0.388552
H  -5.704844 4.344545 -1.690029
H  -5.99421 2.61537 -2.118189
H  4.350865 1.162442 -3.25848
H  5.870684 1.19318 -2.277829
H  5.246881 2.715911 -3.037646
H  6.319789 1.833128 1.644607
H  6.039898 2.558372 0.011608
H  7.6167 1.743077 0.389739
