program: Gaussian 09
title: 000097246
version: EM64L-G09RevD.01
frameworkgroup: C1[X(C5H4N6O2S2)]
method: RPBEPBE
basis: SDD
operation: Freq
keyword: #p
keyword: freq=noraman
keyword: PBEPBE/SDD
title: #p freq=noraman PBEPBE/SDD
converged: YES YES NO NO
title: Mulliken charges:
elementType: S S O O N N N N N N C C C C C H H H H
charge: 0.354696 0.272751 -0.166193 -0.162191 -0.383108 0.122247 -0.046952 -0.031739 -0.069150 -0.576241 -0.723180 0.251588 -0.353406 0.113993 -0.087718 0.419237 0.370935 0.351671 0.342761
chargesum: 0.00000
title: Mulliken charges with hydrogens summed into heavy atoms:
elementType: S S O O N N N N N N C C C C C
charge: 0.354696 0.272751 -0.166193 -0.162191 -0.012173 0.122247 -0.046952 -0.031739 -0.069150 0.118191 -0.303943 0.251588 -0.353406 0.113993 -0.087718
polarizability: 2.78612268e+02 -1.37314988e+01 9.46758225e+01 3.37152959e+00 -5.06313943e+00 1.01123638e+02
1716.lowfreq: -3.3735 0.0006 0.0011 0.0033 4.3272 7.1424 15.2854 18.5983 48.9223
frequency: 15.1753 18.5706 48.9080 94.4592 115.6376 125.8405 167.9538 190.1291 235.5022 239.6077 337.9262 350.6927 355.7628 391.8599 415.2612 467.9479 479.8822 490.5666 517.6336 532.8313 535.8918 545.0404 574.5219 579.0430 624.9351 691.7446 726.0989 759.3667 788.1671 806.7987 867.5606 931.6729 947.6953 957.7784 1106.5642 1153.7354 1195.6950 1246.9089 1259.2581 1284.2610 1361.4054 1388.4949 1414.0586 1542.8842 1621.9401 1648.7973 1658.3833 2959.3476 3467.6326 3555.5908 3706.5225
redmass: 11.0446 11.4953 11.8173 9.5906 7.0370 8.5338 11.7721 12.7577 2.8806 2.7395 2.3346 5.1929 12.1339 9.6491 11.7572 1.3033 8.1365 8.9430 10.6571 5.4898 7.9622 7.8464 8.1301 14.0664 9.4095 10.3195 9.1252 2.1940 6.2652 2.4985 7.4039 5.3605 4.0171 6.4952 3.8690 5.8183 1.1312 3.0343 2.7453 1.9496 1.7160 11.3995 5.2910 3.5256 1.3998 8.4479 8.6312 1.0858 1.0768 1.0459 1.1041
irintensity: 2.1237 0.7092 3.0563 2.0018 7.4264 9.4827 0.8286 1.0131 13.2670 10.8304 36.2763 6.6163 25.3559 2.8824 4.4034 264.4796 18.6489 23.9146 6.8481 17.8467 2.5778 13.5016 24.5487 1.6984 8.0642 4.0207 37.8132 52.8002 8.3944 74.4214 15.4234 65.0692 29.3704 5.6232 51.8478 95.1383 94.7651 37.4024 38.1700 116.2237 3.8182 28.0059 214.8944 275.3726 422.6790 181.4947 415.5079 144.4456 46.2014 209.7652 67.6708
temp: 298.150 k
press: 1.00000 atm
elementType: 16 16 8 8 7 7 7 7 7 7 6 6 6 6 6 1 1 1 1
symmnumber: 1
zpe: 284112.8 jmol-1
zpe.correction: 0.108213 hartree
zpe.thermalcorrener: 0.122550 hartree
zpe.thermalcorrenthalpy: 0.123494 hartree
zpe.thermalcorrgfe: 0.063827 hartree
zpe.sumelectzpe: -1466.834475 hartree
zpe.sumelectthermal: -1466.820137 hartree
zpe.sumelectthermalent: -1466.819193 hartree
zpe.sumelectthermalfe: -1466.878860 hartree
dipole: -6.6075 1.0307 1.7643
dipole: 6.9162
quadrupole: -70.8971 -115.6750 -101.4035
quadrupole: 15.4649 1.3673 -3.1800
quadrupole: 25.0948 -19.6831 -5.4117 15.4649 1.3673 -3.1800
hfenergy: -1466.9426874 hartree
pointgroup: C01 [X(C5H4N6O2S2)]
dipole: 2.5550895 -0.5495097 0.7574106 debye
dipolederiv: -0.4045657 -0.0046288 0.0369716 0.0979911 0.0005979 0.0173097 -0.0924227 0.0456238 0.0532832 -0.5485046 -0.0347284 -0.0138062 0.0527601 0.1003725 -0.11651 0.0973692 -0.1120615 -0.4367713 -0.5036827 0.0264353 0.0141162 0.0220464 -1.0195883 -0.046429 0.0141145 0.00378 -0.285861 -1.2514112 0.3967731 -0.0138751 0.042763 -0.5402118 0.0035908 0.1249452 -0.0204228 -0.3397879 -1.011122 0.504726 -0.0126367 0.26124 -0.9384043 -0.0150544 0.0422445 0.0235148 -0.306521 0.6730087 -0.4235169 0.1613225 -0.7963656 0.1857063 -0.2257293 0.0988775 -0.0616826 -0.2187169 -1.0603048 0.3626174 -0.1941205 0.0806204 -0.0849155 0.0193557 0.2381865 -0.0882541 -0.0873848 0.0917774 -0.1012767 -0.3012956 -0.0129645 -0.1052374 -0.0726477 -0.0894111 -0.0246563 -0.3936679 -1.1900208 0.0875277 0.2536754 -0.1437922 -0.200747 -0.038266 -0.6255782 -0.0585414 -0.4272222 -1.9343764 0.0338366 0.133452 -0.0010309 -0.6467016 0.1182112 0.1567633 0.1251306 -0.2470154 -0.2664751 -0.0635773 0.0669389 0.2368372 -0.1545834 0.0295091 0.1428276 0.091318 0.2008761 1.2918482 -0.3299816 -0.0166787 0.1894549 1.1774399 0.1368089 -0.1777112 0.0546342 0.1585185 1.0266627 0.0647904 0.0781603 0.055911 -0.0764197 0.1186167 0.2216257 0.0737419 0.3989043 1.7559393 -0.5052799 0.0290142 -0.0755217 1.1805244 0.023437 -0.2719687 -0.0131747 0.4014826 2.0943412 -0.0290532 -0.2643803 0.0772014 0.1332276 0.1002817 0.2051992 0.0832218 0.7140671 0.4304076 0.0067398 0.0359412 -0.0598163 0.0622635 0.0245518 -0.1128346 -0.0140047 0.0919057 0.1925474 0.0339543 0.0083581 0.0084298 0.1378261 0.0249919 0.0453307 -0.0036771 0.3334048 0.2757443 -0.0229012 -0.0345844 -0.054857 0.3991753 -0.0429627 -0.1282396 -0.0455591 0.2224343 0.3381867 -0.0024567 0.0334273 0.019093 0.3896754 -0.0590654 0.1106822 -0.0589308 0.168072 unknown
polarizability: 277.9405033|-17.8869415|94.308924|3.1210087|3.4504904|102.1623013 unknown
InChI: InChI=1S/C5H4N6O2S2/c6-3-9-11-5(15-3)14-2-1(12)7-4(13)10-8-2/h2,7H,6H2
charge 0 multiplicity 1
19 atoms
S  0.090565 0.123729 1.421253
S  3.232593 0.366538 1.579215
O  -1.785738 -2.314282 0.03462
O  -4.912351 1.142507 0.070684
N  -3.342143 -0.584718 0.081991
N  -1.415948 1.42242 -0.448829
N  -2.657675 1.768933 -0.382263
N  1.898424 -0.193505 -0.670777
N  3.243348 -0.186798 -1.065722
N  5.438467 0.112797 -0.162885
C  -0.976308 0.002457 -0.164302
C  -2.027028 -1.085889 -0.005628
C  1.705987 0.061374 0.610718
C  -3.73261 0.765257 -0.050191
C  4.0751 0.070712 -0.049198
H  -0.232514 -0.269316 -0.941793
H  -4.090952 -1.275155 0.228145
H  5.847151 -0.080082 -1.075798
H  6.042632 0.356421 0.61566
