program: Gaussian 09
title: 000097233
version: EM64L-G09RevD.01
frameworkgroup: C1[X(C7H4BrNO3)]
method: RPBEPBE
basis: SDD
operation: Freq
keyword: #p
keyword: freq=noraman
keyword: PBEPBE/SDD
title: #p freq=noraman PBEPBE/SDD
converged: YES YES NO NO
title: Mulliken charges:
elementType: Br O O O N C C C C C C C H H H H
charge: 0.074270 -0.188700 -0.202211 -0.190225 0.017551 0.278153 0.241001 -0.331655 -0.245210 -0.149040 -0.244029 -0.165743 0.294261 0.303604 0.268489 0.239481
chargesum: 0.00000
title: Mulliken charges with hydrogens summed into heavy atoms:
elementType: Br O O O N C C C C C C C
charge: 0.074270 -0.188700 -0.202211 -0.190225 0.017551 0.278153 0.241001 -0.037394 0.058394 0.119450 -0.244029 0.073739
polarizability: 1.81681707e+02 -1.41713560e+00 1.25253582e+02 -1.16591379e-01 3.07044592e+00 4.08303774e+01
1716.lowfreq: -3.1608 -0.0003 0.0004 0.0007 4.1854 8.1184 49.4092 68.3276 82.0652
frequency: 49.4082 68.3252 82.0651 138.1187 155.8035 223.6908 248.6665 273.7559 317.7575 389.7838 437.0219 442.7914 511.4587 558.3357 632.0911 658.1698 679.0386 725.7055 782.3752 847.2134 859.0304 925.8115 973.6499 987.4983 1049.0656 1080.5959 1138.7934 1178.3048 1205.9527 1249.4506 1344.2749 1359.3567 1393.7339 1406.5870 1444.8419 1553.8733 1578.8819 1603.4673 3022.7991 3157.6390 3173.3408 3190.4147
redmass: 14.9313 7.8830 4.2952 13.4303 4.8563 10.4037 10.5367 4.7036 6.2002 9.3870 3.2889 8.9343 5.6673 5.4589 6.6485 5.2135 8.3616 5.1546 8.8887 1.5023 5.0438 1.3971 1.6690 1.4142 4.9223 2.0745 2.3658 1.9315 8.8384 1.3503 2.4595 2.6852 11.1916 2.4375 2.4287 7.3012 8.1213 7.7939 1.0895 1.0922 1.0892 1.0974
irintensity: 0.6999 8.9782 6.5937 0.5764 2.1805 3.9089 4.8771 1.7197 2.3069 0.4246 8.3432 26.2559 0.8599 2.5727 5.3226 16.6989 16.3874 2.6562 54.6820 35.5145 41.2423 5.3332 5.4226 7.2190 2.2893 30.6124 9.5082 175.0291 269.0278 16.0951 101.7321 38.9547 16.3718 19.2476 20.5724 136.8123 44.7615 92.5171 25.4761 6.8532 1.5376 1.7520
temp: 298.150 k
press: 1.00000 atm
elementType: 35 8 8 8 7 6 6 6 6 6 6 6 1 1 1 1
symmnumber: 1
zpe: 257788.9 jmol-1
zpe.correction: 0.098187 hartree
zpe.thermalcorrener: 0.108865 hartree
zpe.thermalcorrenthalpy: 0.109809 hartree
zpe.thermalcorrgfe: 0.059522 hartree
zpe.sumelectzpe: -562.072993 hartree
zpe.sumelectthermal: -562.062315 hartree
zpe.sumelectthermalent: -562.061371 hartree
zpe.sumelectthermalfe: -562.111658 hartree
dipole: -3.0492 -2.5128 -0.4043
dipole: 3.9718
quadrupole: -90.9403 -83.5841 -77.7429
quadrupole: 3.1187 -1.5008 -1.9410
quadrupole: -6.8512 0.5050 6.3462 3.1187 -1.5008 -1.9410
hfenergy: -562.1711798 hartree
pointgroup: C01 [X(C7H4Br1N1O3)]
dipole: 1.2881705 0.8843683 -0.0168287 debye
dipolederiv: -0.8069239 0.0948875 -0.0646856 0.129951 -0.0314904 0.0074738 -0.0534787 -0.0005384 0.0082321 -0.6134119 0.210466 -0.0271303 0.2586425 -0.7561127 0.1531611 -0.0307873 0.1374744 -0.2482629 -0.7883339 -0.1368035 0.064828 -0.1716955 -0.5375908 0.1193409 0.0510592 0.0977623 -0.2436148 -0.3358181 0.1180813 -0.0218818 -0.2555155 -0.9977618 -0.0621086 -0.0277734 0.0088751 -0.3174071 1.7594193 -0.2395042 -0.0363084 -0.2124838 1.0903345 -0.3238605 -0.008199 -0.2739572 0.2606204 -0.6619768 0.1505391 -0.0281848 0.2683952 0.1118576 0.0818909 -0.0365887 0.0265896 0.0434597 -0.0782058 -0.2922822 -0.0621495 -0.5483284 -0.3219757 -0.0778908 -0.0064562 -0.1083302 0.0207812 0.1363013 -0.2570062 0.0000536 0.1470239 -0.0845449 0.0067287 -0.020355 -0.0170452 -0.0892819 -0.6413483 0.0303087 -0.0454829 -0.1953757 -0.0221267 -0.0149467 -0.0529958 0.0220382 -0.0276358 -0.3817577 0.2968192 -0.0073391 0.2250555 -0.0621959 0.0163235 -0.0281153 0.0230795 -0.060829 1.5904058 -0.2004534 0.1378598 -0.1429401 0.0692926 -0.001852 0.1363788 0.0030888 -0.1161951 0.6547734 0.2317395 0.1833037 0.4320204 1.2648143 0.1141756 0.1419049 0.0912052 0.1859756 0.0944438 0.044953 -0.0044254 0.0001212 0.0635689 -0.0149058 0.0161961 0.0059077 0.1716914 0.1150933 0.0116304 -0.0034845 0.0700624 0.0893071 -0.0031811 -0.0168473 -0.0135247 0.1477299 0.0425943 -0.0555548 -0.0118281 -0.0561297 0.0447579 -0.0132287 -0.0106735 -0.0149431 0.1555683 -0.0852547 -0.0078203 -0.0731446 0.0511966 0.079866 0.0128796 -0.0532689 0.012318 0.109168 unknown
polarizability: 180.3222397|-6.5331091|126.037887|9.5407216|1.2707803|41.4055403 unknown
InChI: InChI=1S/C7H4BrNO3/c8-6-1-2-7(9(11)12)5(3-6)4-10/h1-4H
charge 0 multiplicity 1
16 atoms
Br 4.138257 -0.285214 0.250588
O  -2.273035 2.155424 -0.396739
O  -2.826564 0.024763 0.194432
O  -0.446446 -3.146007 -0.333238
N  -1.961601 0.938946 -0.099232
C  -0.517163 0.582668 -0.074289
C  -0.064835 -0.766896 -0.146674
C  0.386737 1.659458 0.060106
C  1.332358 -0.99874 -0.054664
C  1.768649 1.409658 0.154316
C  2.227641 0.0730 0.104726
C  -0.923123 -1.98407 -0.400117
H  -0.00405 2.679416 0.097426
H  1.674417 -2.037008 -0.119257
H  2.472276 2.238123 0.269803
H  -1.980717 -1.807421 -0.672287
