program: Gaussian 09
title: 000097262
version: EM64L-G09RevD.01
frameworkgroup: C1[X(C16H14FNOS)]
method: RPBEPBE
basis: SDD
operation: Freq
keyword: #p
keyword: freq=noraman
keyword: PBEPBE/SDD
title: #p freq=noraman PBEPBE/SDD
converged: YES YES NO NO
title: Mulliken charges:
elementType: S F O N C C C C C C C C C C C C C C C C H H H H H H H H H H H H H H
charge: 0.156484 -0.208276 -0.259724 -0.446624 -0.692071 0.326705 0.212485 0.302999 0.180512 -0.573093 -0.403593 0.616609 -0.585194 -0.534217 -0.355006 0.347023 -0.389196 0.214045 -0.833409 -0.783510 0.253454 0.254274 0.324807 0.263481 0.270269 0.244053 0.254605 0.307729 0.257378 0.267349 0.275363 0.257415 0.255902 0.220970
chargesum: 0.00000
title: Mulliken charges with hydrogens summed into heavy atoms:
elementType: S F O N C C C C C C C C C C C C C C C C
charge: 0.156484 -0.208276 -0.259724 -0.138895 -0.184342 0.326705 0.212485 0.302999 0.180512 -0.248286 -0.140113 0.616609 -0.314925 -0.534217 -0.110953 0.347023 -0.134590 0.214045 -0.033320 -0.049223
polarizability: 3.50570487e+02 -5.08739849e+00 2.15130328e+02 1.34262619e+00 -4.47079421e+00 1.02956669e+02
1716.lowfreq: -5.2931 -2.0327 -0.0016 -0.0010 -0.0008 3.7611 37.2368 40.1281 49.0456
frequency: 37.2219 40.1241 49.0352 61.9467 77.0627 93.1149 104.1379 133.1543 146.9456 154.4898 192.8687 214.2944 225.3377 266.6140 270.8952 298.8004 325.9069 364.6303 401.8621 410.2262 440.7080 454.0953 460.6835 510.1958 540.0135 547.6178 572.3103 591.6192 623.7163 632.6577 645.7609 676.9318 714.5339 729.0367 758.0382 758.6180 782.4546 798.3131 821.4855 864.3962 901.5770 918.2551 920.7020 927.6871 945.6694 959.7215 968.9198 977.5038 986.5983 1005.5542 1016.7966 1040.8851 1095.6719 1127.2057 1135.9724 1143.1517 1185.8151 1200.6476 1220.8397 1232.0024 1247.4529 1274.1627 1308.3075 1341.3307 1357.6916 1379.4877 1388.4694 1423.8311 1424.2704 1437.1862 1443.0490 1449.7756 1450.7940 1459.5401 1467.8714 1489.4516 1497.2607 1577.7398 1596.3602 1616.4815 1621.0048 1623.5039 2988.6537 2996.1532 3012.6547 3033.7004 3095.9594 3100.9198 3136.8110 3141.2674 3141.6256 3146.2458 3163.0000 3176.1631 3177.0039 3389.7041
redmass: 3.4529 2.8116 1.4349 4.0594 3.4415 5.5700 5.0028 1.1920 3.6344 4.4264 6.1998 2.9433 8.7361 3.7407 4.8993 7.2927 5.0102 7.7242 5.5071 3.8697 3.4552 5.2804 3.5124 5.4747 3.2162 4.4739 5.4503 3.3988 5.6045 6.7896 3.9425 6.9139 6.3084 3.8291 4.8631 2.9201 4.7902 1.3031 1.4586 1.4572 1.4852 3.5694 1.6236 4.9218 1.3694 3.1566 1.1778 1.8087 1.2772 1.9710 4.7812 1.6326 1.8096 1.5286 1.1513 1.9888 2.6592 1.7397 3.9139 1.7352 1.8005 1.4676 3.6225 1.1724 4.5645 5.2005 1.2192 6.2296 1.1627 4.8619 1.0561 1.1189 2.3727 1.0568 1.1106 4.3322 2.4586 6.3045 7.6347 4.6592 8.0110 7.6091 1.0611 1.0359 1.0279 1.0992 1.0982 1.1007 1.1049 1.0903 1.1053 1.0922 1.0933 1.0935 1.0957 1.0768
irintensity: 1.0137 1.8862 1.8838 0.5926 5.7796 2.0744 0.9730 0.6581 0.7043 5.8649 0.9771 5.2135 0.5066 1.7394 1.9258 0.6102 1.6930 2.0654 13.3979 2.6489 2.9737 9.6612 12.5147 2.3310 1.9599 5.0171 7.7487 0.0861 13.1576 3.3861 3.2878 0.8107 4.9947 1.6651 3.9660 6.2062 4.4608 35.8436 47.5291 36.2588 9.5733 33.0154 0.5461 4.3953 0.9770 9.0402 4.6059 34.1244 22.5183 15.0786 1.6265 14.3963 15.0530 20.6460 0.0457 1.1929 46.0920 8.1987 6.7415 37.9047 126.0366 9.1017 6.5300 12.2457 120.3192 23.5242 69.5822 25.6426 8.4151 151.8955 19.0170 22.7465 78.0225 14.3936 22.0448 1.9452 554.2664 121.3247 19.7978 98.2013 30.6690 12.6830 8.9899 12.8211 27.2112 4.8716 8.9702 16.9335 11.2863 7.6692 9.7865 4.0090 3.4192 8.1302 6.8219 103.3116
temp: 298.150 k
press: 1.00000 atm
elementType: 16 9 8 7 6 6 6 6 6 6 6 6 6 6 6 6 6 6 6 6 1 1 1 1 1 1 1 1 1 1 1 1 1 1
symmnumber: 1
zpe: 677552.4 jmol-1
zpe.correction: 0.258066 hartree
zpe.thermalcorrener: 0.276575 hartree
zpe.thermalcorrenthalpy: 0.277519 hartree
zpe.thermalcorrgfe: 0.210019 hartree
zpe.sumelectzpe: -1244.613496 hartree
zpe.sumelectthermal: -1244.594987 hartree
zpe.sumelectthermalent: -1244.594042 hartree
zpe.sumelectthermalfe: -1244.661543 hartree
dipole: 3.0274 2.6747 0.9308
dipole: 4.1455
quadrupole: -123.7413 -121.2555 -125.4568
quadrupole: 7.2415 2.5567 4.6788
quadrupole: -0.2567 2.2290 -1.9723 7.2415 2.5567 4.6788
hfenergy: -1244.8715619 hartree
pointgroup: C01 [X(C16H14F1N1O1S1)]
dipole: 1.0906072 1.1653935 0.3354195 debye
polarizability: 350.3392504|6.8862657|214.7456974|4.9554502|-8.7067459|103.5725357 unknown
InChI: InChI=1S/C16H14FNOS/c1-9(19)18-15-7-11-5-10-6-12(17)3-4-13(10)14(11)8-16(15)20-2/h3-4,6-8,18H,5H2,1-2H3
charge 0 multiplicity 1
34 atoms
S  2.658767 2.830878 -0.585854
F  -6.202922 -0.784263 0.040167
O  3.83926 -2.323374 0.35439
N  3.517073 -0.048123 -0.142958
C  -1.262512 -1.861191 0.219868
C  -0.145998 -0.838777 0.043133
C  -0.704722 0.456167 -0.176139
C  -2.523186 -1.017142 0.077197
C  -2.173603 0.350401 -0.157099
C  1.23942 -1.046634 0.067336
C  0.147186 1.564899 -0.365771
C  2.104578 0.069053 -0.127129
C  -3.869155 -1.414692 0.146005
C  1.543117 1.373838 -0.330146
C  -3.178532 1.329769 -0.324305
C  -4.84259 -0.410599 -0.025228
C  -4.536652 0.944011 -0.257501
C  4.306157 -1.178241 0.074314
C  2.868093 3.378208 1.220919
C  5.807909 -0.933902 -0.054825
H  -1.208282 -2.362895 1.205586
H  -1.211179 -2.661783 -0.543397
H  1.684174 -2.030809 0.228956
H  -0.249448 2.569888 -0.542119
H  -4.173149 -2.450536 0.323383
H  -2.921155 2.3786 -0.505679
H  -5.347975 1.666921 -0.381472
H  3.992117 0.835863 -0.377407
H  3.554026 4.239741 1.208327
H  3.295353 2.55819 1.817641
H  1.889818 3.676839 1.624863
H  6.20568 -1.567859 -0.866399
H  6.304129 -1.251248 0.878345
H  6.072505 0.117002 -0.263103
