program: Gaussian 09
title: 000097191
version: EM64L-G09RevD.01
frameworkgroup: C1[X(C5H6N2O3)]
method: RPBEPBE
basis: SDD
operation: Freq
keyword: #pfreq=noraman
keyword: PBEPBE/SDD
title: #p freq=noraman PBEPBE/SDD
converged: NO YES NO NO
title: Mulliken charges:
elementType: O O O N N C C C C C H H H H H H
charge: -0.446722 -0.239134 -0.242285 -0.401805 -0.389358 0.368808 -0.405009 -0.418588 0.139749 0.188335 0.369762 0.261324 0.264536 0.229146 0.363786 0.357456
chargesum: 0.00000
title: Mulliken charges with hydrogens summed into heavy atoms:
elementType: O O O N N C C C C C
charge: -0.089267 -0.239134 -0.242285 -0.032044 -0.025572 0.368808 -0.143686 0.075095 0.139749 0.188335
polarizability: 9.53205216e+01 -7.52583053e+00 9.45822543e+01 -1.90147351e+00 1.49517643e-01 4.08118309e+01
1716.lowfreq: -11.9271 -6.4632 0.0005 0.0007 0.0008 5.5733 75.5537 141.0533 168.9050
frequency: 75.5260 141.0529 168.9042 176.6789 221.3565 339.1389 371.1701 381.5319 492.0442 509.7256 541.1246 578.0835 663.3147 677.9406 703.3222 757.3400 780.4379 820.8184 914.9103 943.5258 954.5284 1003.4569 1019.3866 1146.0312 1158.7200 1201.6281 1298.1744 1321.1516 1342.7018 1355.8731 1369.0652 1452.7351 1473.8806 1612.3495 1664.7081 1679.4544 3010.5953 3076.3822 3202.4130 3507.4680 3529.3418 3566.3862
redmass: 3.8798 5.9275 6.5210 5.4116 3.3745 6.7836 2.6721 1.6995 5.6903 7.3810 3.6236 7.3955 4.3382 2.8771 2.2046 1.3732 1.6633 1.6163 4.6242 2.1246 3.6861 2.6699 4.2252 1.8901 1.3133 3.4474 1.7408 1.2705 2.5706 1.2335 1.8248 1.1785 2.6042 7.3067 7.0517 6.0677 1.0595 1.1050 1.0942 1.0773 1.0772 1.0666
irintensity: 11.7318 0.9316 3.7385 6.1567 8.1050 17.1023 13.4658 189.2280 1.3606 15.2368 7.5743 7.0397 7.0297 1.8065 32.6921 3.6687 157.5625 101.0170 2.4530 78.3642 19.7233 16.4219 6.8813 15.7397 49.7967 25.3608 50.0200 12.3033 76.5392 20.8587 37.5021 34.8535 51.6806 43.2471 408.7228 715.7446 22.2935 10.8705 0.8175 133.5334 53.4902 14.3992
temp: 298.150 k
press: 1.00000 atm
elementType: 8 8 8 7 7 6 6 6 6 6 1 1 1 1 1 1
symmnumber: 1
zpe: 306270.2 jmol-1
zpe.correction: 0.116652 hartree
zpe.thermalcorrener: 0.125464 hartree
zpe.thermalcorrenthalpy: 0.126408 hartree
zpe.thermalcorrgfe: 0.082542 hartree
zpe.sumelectzpe: -528.591204 hartree
zpe.sumelectthermal: -528.582392 hartree
zpe.sumelectthermalent: -528.581448 hartree
zpe.sumelectthermalfe: -528.625314 hartree
dipole: -4.4017 -1.7841 -0.7627
dipole: 4.8104
quadrupole: -62.8227 -69.1609 -54.6285
quadrupole: 9.0509 3.8242 -0.8330
quadrupole: -0.6187 -6.9568 7.5755 9.0509 3.8242 -0.8330
hfenergy: -528.7078561 hartree
pointgroup: C01 [X(C5H6N2O3)]
dipole: -1.750357 0.6608516 0.2850966 debye
dipolederiv: -0.8577574 0.025442 0.1504982 -0.0211491 -0.4785719 0.1810128 0.2380697 0.1923396 -0.277935 -0.5334002 0.1985438 -0.0127245 0.1740461 -1.36131 0.0449478 -0.0138444 0.0608544 -0.3913111 -1.0337628 -0.4718044 -0.0136572 -0.2988398 -0.7882739 0.0007753 -0.0228385 -0.0103479 -0.3745003 -0.8145254 0.6783749 -0.0405012 -0.1138231 -1.0695366 0.0197956 -0.0856026 0.0252925 -0.2993318 -0.4660073 -0.265421 0.0100783 -0.2281182 -1.2575683 0.0220642 0.0069739 0.0209654 -0.3570564 0.3344632 0.0156105 0.0838544 0.4100762 0.9849043 0.0227428 0.1294967 0.021919 0.0322812 -0.8953725 -0.3079121 -0.0217961 -0.0075193 -0.2364842 -0.0140329 -0.0106187 -0.0200772 -0.2469275 0.5627697 0.1257397 -0.1499452 0.1073301 0.3301773 -0.0982274 -0.3031855 -0.1321318 0.3521891 1.1983661 -0.3684337 0.0539675 -0.1214435 1.9150862 -0.0690767 0.0511767 -0.1028944 0.3367696 1.4515698 0.4299377 0.0445422 0.1513386 1.3497084 -0.0272017 0.040289 -0.015604 0.2822139 0.3442372 0.0280178 -0.0210678 0.0324646 0.2334013 0.017448 -0.0087697 0.0410176 0.3276495 0.0716243 0.037829 -0.0047819 0.0516704 0.014473 0.0069985 -0.0013185 0.0073175 0.1844432 -0.0168809 -0.0198793 -0.0316049 -0.0636307 0.0890213 -0.0192988 -0.0051883 0.0205456 -0.0577631 0.0277971 -0.0350004 0.0375947 0.0222029 -0.1377021 -0.0228761 0.0485166 -0.0573301 0.0690978 0.2212167 -0.0111147 -0.0066917 -0.021863 0.1474272 0.0068373 -0.0081759 0.0077609 0.3439486 0.4056623 -0.0599298 -0.0777647 -0.0727423 0.2652482 -0.0719087 -0.0549805 -0.0596269 0.0762322 unknown
polarizability: 94.8676543|7.5937254|94.9449875|0.9658674|-2.5859254|40.901965 unknown
InChI: InChI=1S/C5H6N2O3/c8-2-3-1-4(9)7-5(10)6-3/h1,6-8H,2H2
charge 0 multiplicity 1
16 atoms
O  -3.236977 -0.204346 0.337186
O  0.923767 -2.63725 0.097075
O  2.501722 1.778853 0.006948
N  -0.616127 -0.876811 -0.0760
N  1.680399 -0.410179 0.03384
C  -0.906709 0.481778 -0.138316
C  0.096427 1.422956 -0.10617
C  -2.383441 0.809076 -0.302382
C  0.689057 -1.403697 0.025656
C  1.499701 1.011115 -0.020947
H  -1.397424 -1.540898 -0.046636
H  -0.116221 2.491877 -0.148909
H  -2.660829 0.762234 -1.369824
H  -2.588421 1.83063 0.067694
H  2.64794 -0.742167 0.09798
H  -3.248063 -0.06577 1.318104
