program: Gaussian 09
title: 000010792
version: EM64L-G09RevD.01
frameworkgroup: C1[X(C4H8Br2)]
method: RPBEPBE
basis: SDD
operation: Freq
keyword: #pfreq=noraman
keyword: PBEPBE/SDD
title: #p freq=noraman PBEPBE/SDD
converged: YES YES NO NO
title: Mulliken charges:
elementType: Br Br C C C C H H H H H H H H
charge: -0.008871 0.014906 -0.384208 -0.325019 -0.652040 -0.679717 0.303033 0.226506 0.245121 0.288790 0.303953 0.233838 0.212067 0.221642
chargesum: 0.00000
title: Mulliken charges with hydrogens summed into heavy atoms:
elementType: Br Br C C C C
charge: -0.008871 0.014906 -0.081175 0.146608 -0.059297 -0.012170
polarizability: 8.41551331e+01 5.15334319e+00 8.63083721e+01 4.91549692e+00 1.09402263e+00 4.92728031e+01
1716.lowfreq: -3.2077 -0.0005 -0.0002 0.0001 5.9342 6.8217 59.7271 81.7700 126.8729
frequency: 59.7212 81.7696 126.8707 191.0914 217.2485 289.1669 321.0402 351.8681 577.3356 631.2625 779.1331 864.9558 888.1471 987.1127 1037.8357 1089.5251 1096.1386 1143.2235 1215.2051 1228.3031 1270.2045 1321.3786 1328.9258 1395.7230 1424.2963 1468.9763 1478.5376 1485.3702 2985.5273 3005.0320 3046.4185 3056.3164 3075.2074 3085.6895 3089.8715 3135.2614
redmass: 5.5596 1.8655 5.4084 2.2183 1.4376 4.6436 3.5117 2.6617 3.0857 3.9595 1.2569 1.4652 2.0701 1.8852 2.5874 1.7151 1.2290 1.7921 1.2790 1.1996 1.1602 1.3504 1.2983 1.1949 1.0963 1.0652 1.0509 1.0557 1.0358 1.0619 1.0572 1.0981 1.0914 1.0985 1.0996 1.1079
irintensity: 0.6846 0.3065 0.5873 1.2382 0.8978 4.2276 7.3974 1.2730 17.1630 30.1425 15.5956 14.0637 25.5849 0.1365 4.6788 8.7707 8.9271 9.4254 25.6607 14.7767 14.6796 6.9408 2.7503 11.8849 9.0987 7.0279 13.4451 17.2593 26.8500 14.1853 11.5901 0.2764 3.6669 32.5116 53.0464 3.2803
temp: 298.150 k
press: 1.00000 atm
elementType: 35 35 6 6 6 6 1 1 1 1 1 1 1 1
symmnumber: 1
zpe: 292066.4 jmol-1
zpe.correction: 0.111242 hartree
zpe.thermalcorrener: 0.119397 hartree
zpe.thermalcorrenthalpy: 0.120341 hartree
zpe.thermalcorrgfe: 0.075643 hartree
zpe.sumelectzpe: -183.644775 hartree
zpe.sumelectthermal: -183.636621 hartree
zpe.sumelectthermalent: -183.635677 hartree
zpe.sumelectthermalfe: -183.680375 hartree
dipole: 1.8317 3.2368 0.4669
dipole: 3.7484
quadrupole: -58.5883 -54.6700 -55.2911
quadrupole: 3.9654 -0.0910 0.4149
quadrupole: -2.4052 1.5131 0.8920 3.9654 -0.0910 0.4149
hfenergy: -183.7560176 hartree
pointgroup: C01 [X(C4H8Br2)]
dipole: 1.3276881 -0.6036791 -0.2182594 debye
dipolederiv: -0.264413 0.1844572 -0.0038154 0.1929807 -0.5564408 -0.0230981 -0.0265406 0.0310743 -0.134965 -0.4585476 -0.1745817 0.0357927 -0.1430953 -0.1491067 0.0088439 0.1163312 0.0528562 -0.145724 0.1394416 -0.4390568 0.0500527 -0.2023056 0.8329753 -0.026511 0.1608895 0.0303087 0.060277 0.0404506 0.0028846 0.0149848 0.006255 -0.1503437 0.0084538 -0.1537979 0.0213549 0.1356358 0.6151624 0.3864596 -0.1728448 0.1745299 -0.0273478 -0.082229 -0.2174851 -0.0826312 0.1243407 -0.0876489 0.120383 0.003237 -0.011576 0.056951 0.0278542 0.069344 -0.01319 0.0870517 0.0346012 0.0703431 -0.0163298 0.0183189 -0.0607606 0.0667466 -0.0073313 0.0162806 -0.0556832 0.0650702 0.0402702 -0.0318927 0.0279895 0.0725515 0.0344574 0.0239067 0.0428767 -0.1352799 -0.0251569 -0.067884 -0.0224496 -0.0598287 -0.0561089 -0.057199 -0.0333221 -0.0776641 0.0565559 -0.0486756 0.0210243 0.0517956 0.0495998 -0.071189 0.0014305 0.0554834 -0.0289827 0.0850479 -0.0249305 -0.0661541 0.0668104 -0.0222828 0.0928683 0.0736875 0.0224721 0.0290088 -0.0507257 -0.1811775 0.0179351 0.0447487 -0.0056316 0.0546582 0.0166255 0.0487422 0.0166534 0.0972273 0.0855932 -0.0881614 -0.0675719 -0.0415598 -0.1061248 -0.0763062 -0.0509997 -0.0991125 0.0247606 0.1102309 -0.007919 0.0474823 0.016606 0.067418 0.027244 -0.0076923 0.061167 -0.1485191 unknown
polarizability: 89.3518813|-2.8897615|80.3918851|-6.294516|-3.2443096|49.9925418 unknown
InChI: InChI=1S/C4H8Br2/c1-2-4(6)3-5/h4H,2-3H2,1H3
charge 0 multiplicity 1
14 atoms
Br -0.793915 2.10889 0.012869
Br -2.510276 -1.181231 0.296936
C  0.082485 0.273294 0.263706
C  1.559189 0.370576 -0.181334
C  -0.705528 -0.773066 -0.518863
C  2.38927 -0.877328 0.211693
H  0.006476 0.104805 1.35062
H  1.607883 0.539448 -1.273991
H  1.998089 1.264571 0.296444
H  -0.177668 -1.740536 -0.505901
H  -0.90916 -0.456951 -1.552667
H  3.45299 -0.710252 -0.033517
H  2.066074 -1.787304 -0.325095
H  2.32259 -1.078515 1.2969
