program: Gaussian 09
title: 000097178
version: EM64L-G09RevD.01
frameworkgroup: C1[X(C9H18O)]
method: RPBEPBE
basis: SDD
operation: Freq
keyword: #pfreq=noraman
keyword: PBEPBE/SDD
title: #p freq=noraman PBEPBE/SDD
converged: YES YES NO NO
title: Mulliken charges:
elementType: O C C C C C C C C C H H H H H H H H H H H H H H H H H H
charge: -0.458739 0.304612 -0.435575 -0.441414 -0.383051 -0.428665 -0.425210 -0.390694 -0.361628 -0.747733 0.189466 0.229056 0.185155 0.217377 0.201215 0.173486 0.197621 0.207952 0.198622 0.199370 0.203264 0.197604 0.190772 0.192989 0.227154 0.229621 0.207725 0.319650
chargesum: 0.00000
title: Mulliken charges with hydrogens summed into heavy atoms:
elementType: O C C C C C C C C C
charge: -0.139090 0.304612 -0.017053 -0.038881 -0.008350 -0.023093 -0.027219 0.010173 0.022133 -0.083233
polarizability: 1.04961856e+02 9.89849900e-01 9.87456028e+01 9.53525137e-01 1.24584698e+00 8.69762726e+01
1716.lowfreq: -20.5579 -18.7299 0.0005 0.0006 0.0006 30.9861 82.7446 173.4373 185.9692
frequency: 82.0754 173.2758 185.9132 205.0216 238.0368 257.3342 267.6122 299.4149 312.9537 367.9894 372.1937 390.0338 423.8506 484.3820 495.7087 529.8544 672.0996 741.6718 755.8730 795.6887 829.0548 857.8031 867.6849 887.5274 925.1680 943.8142 999.7489 1005.8629 1021.3326 1041.2658 1085.7041 1103.7432 1119.3867 1135.0324 1141.7014 1156.8436 1203.5999 1233.8314 1240.2418 1261.6730 1283.5827 1286.4534 1294.2678 1328.2438 1336.6296 1344.2540 1348.6609 1359.0102 1364.3979 1372.7379 1388.7845 1450.2900 1456.7924 1459.9708 1463.0379 1466.0484 1472.3832 1479.3953 1485.6751 1495.9277 2952.1736 2953.5139 2964.0986 2966.6515 2972.0884 2982.6715 2985.1015 2991.7722 3008.7156 3013.2758 3016.6675 3022.7113 3029.6880 3037.4898 3043.7032 3090.3836 3093.8639 3536.7554
redmass: 2.8288 1.9583 2.3023 1.3958 2.1696 3.0329 1.8028 1.2275 1.8704 2.2344 2.4063 3.1887 1.9904 1.6774 2.4563 2.2751 2.4555 2.1561 1.6670 2.1031 2.5699 1.8686 1.9177 1.8824 1.7799 1.7804 1.8301 1.9490 1.6655 1.9914 1.7521 2.0806 1.8319 2.1434 1.3721 1.3613 1.2281 1.3902 1.3465 1.2150 1.2545 1.5953 1.2642 1.3903 1.4166 1.3977 1.4370 1.3511 1.4783 1.4236 1.3705 1.0735 1.0805 1.0702 1.0868 1.0883 1.0742 1.0626 1.0793 1.0803 1.0615 1.0648 1.0616 1.0625 1.0631 1.0645 1.0597 1.0401 1.0966 1.0952 1.0959 1.1000 1.0981 1.1005 1.0989 1.0995 1.0997 1.0655
irintensity: 1.0397 0.1797 0.0475 2.1171 10.8973 2.7206 11.7838 75.2563 20.4344 1.1265 4.9624 7.3802 1.6991 1.8961 6.6154 1.8346 3.3188 7.3374 3.4796 6.8585 13.5698 8.3539 3.0742 2.0076 19.7853 3.1352 2.3772 27.3157 2.0870 5.8091 5.7735 4.1066 22.2246 14.7468 5.6974 13.3583 23.7605 5.9179 5.5208 0.8208 5.4177 22.3545 2.5832 0.2958 2.6213 0.2525 2.8534 1.1954 6.2829 7.3649 28.7860 1.1149 2.9316 12.3571 13.1924 8.3185 8.7470 3.5009 8.7679 31.7842 32.2049 19.4701 17.3322 28.7483 43.7638 26.7885 9.3256 28.3002 66.1351 27.1564 27.4514 103.9928 53.0994 84.5968 49.3322 31.3063 33.5448 4.9583
temp: 298.150 k
press: 1.00000 atm
elementType: 8 6 6 6 6 6 6 6 6 6 1 1 1 1 1 1 1 1 1 1 1 1 1 1 1 1 1 1
symmnumber: 1
zpe: 668173.4 jmol-1
zpe.correction: 0.254494 hartree
zpe.thermalcorrener: 0.265284 hartree
zpe.thermalcorrenthalpy: 0.266228 hartree
zpe.thermalcorrgfe: 0.219611 hartree
zpe.sumelectzpe: -428.130821 hartree
zpe.sumelectthermal: -428.120030 hartree
zpe.sumelectthermalent: -428.119086 hartree
zpe.sumelectthermalfe: -428.165704 hartree
dipole: -2.1766 0.0901 0.0276
dipole: 2.1786
quadrupole: -71.7576 -62.3396 -62.0562
quadrupole: 1.6090 1.5972 1.0484
quadrupole: -6.3731 3.0449 3.3283 1.6090 1.5972 1.0484
hfenergy: -428.3853144 hartree
pointgroup: C01 [X(C9H18O1)]
dipole: -0.8565616 -0.0291735 -0.0109308 debye
polarizability: 104.946023|-1.004342|98.6787878|-0.9896486|1.5869467|87.0589205 unknown
InChI: InChI=1S/C9H18O/c1-9(10)7-5-3-2-4-6-8-9/h10H,2-8H2,1H3
charge 0 multiplicity 1
28 atoms
O  2.361019 0.75311 0.879012
C  1.378424 0.05144 -0.013232
C  0.505883 1.134594 -0.714285
C  0.59749 -0.945811 0.880982
C  -0.620352 1.788987 0.137811
C  -0.394078 -1.924015 0.206314
C  -2.055307 1.257972 -0.120928
C  -1.626057 -1.310806 -0.51375
C  -2.381032 -0.206253 0.282414
C  2.275388 -0.66254 -1.036973
H  0.063408 0.713444 -1.637147
H  1.219561 1.914238 -1.043875
H  0.058406 -0.36867 1.660027
H  1.361017 -1.539982 1.421176
H  -0.634194 2.876298 -0.074585
H  -0.389757 1.705836 1.221539
H  -0.767977 -2.597911 1.00429
H  0.152873 -2.573673 -0.505762
H  -2.276605 1.37583 -1.202783
H  -2.766106 1.923152 0.41201
H  -2.323887 -2.144114 -0.730189
H  -1.333587 -0.907726 -1.502356
H  -2.207533 -0.34285 1.369836
H  -3.470738 -0.343972 0.133956
H  2.871511 0.077977 -1.598801
H  2.974209 -1.34391 -0.521358
H  1.674169 -1.246305 -1.756042
H  1.848251 1.237961 1.576897
