program: Gaussian 09
title: 000097184
version: EM64L-G09RevD.01
frameworkgroup: C1[X(C11H14N4O3)]
method: RPBEPBE
basis: SDD
operation: Freq
keyword: #p
keyword: freq=noraman
keyword: PBEPBE/SDD
title: #p freq=noraman PBEPBE/SDD
converged: NO YES NO NO
title: Mulliken charges:
elementType: O O O N N N N C C C C C C C C C C C H H H H H H H H H H H H H H
charge: -0.246822 -0.425283 -0.443947 -0.196128 -0.066790 -0.011898 -0.044133 -0.064798 -0.136862 -0.516221 -0.105008 -0.365835 0.104553 -0.211967 -0.082048 0.165617 -0.394086 -0.751689 0.270680 0.246743 0.248365 0.284936 0.286009 0.218561 0.217613 0.332036 0.352104 0.356936 0.246678 0.239630 0.250217 0.242839
chargesum: 0.00000
title: Mulliken charges with hydrogens summed into heavy atoms:
elementType: O O O N N N N C C C C C C C C C C C
charge: -0.246822 -0.073178 -0.087012 -0.196128 -0.066790 -0.011898 -0.044133 0.205881 0.109881 0.017080 0.181001 0.070338 0.104553 0.120069 -0.082048 0.165617 -0.147408 -0.019003
polarizability: 1.97087688e+02 -2.43112621e+00 1.58511098e+02 9.16608227e+00 -3.03881601e+00 9.67171795e+01
1716.lowfreq: -9.5379 -3.3679 -0.0004 0.0002 0.0005 8.9441 23.0725 34.0375 47.4536
frequency: 22.2241 34.0249 47.4487 74.5698 94.2364 110.0158 142.7184 165.1993 189.0247 218.8879 248.3763 262.4198 278.6650 289.9969 318.1624 322.0982 375.7873 393.6860 452.4166 507.0291 509.4010 526.9900 549.1429 604.0809 622.5094 639.9537 674.5013 709.8951 720.3515 760.1289 792.3145 799.8304 844.2272 848.4975 874.9568 902.2218 922.0839 927.8439 930.8393 965.4398 977.2804 1009.5525 1013.9768 1040.7844 1042.0786 1063.1964 1077.0598 1123.5249 1150.7180 1154.9435 1185.9691 1201.8437 1206.4689 1228.1150 1237.2572 1246.9044 1266.2469 1270.6415 1285.7365 1291.7502 1300.4668 1311.1093 1348.9813 1354.0257 1369.7983 1383.9149 1391.4088 1407.7824 1414.9061 1443.6950 1454.8896 1455.3687 1460.5559 1472.3230 1536.5446 1561.2017 2943.8554 2991.2852 2995.1055 3046.1907 3047.8477 3068.7781 3085.2403 3090.2171 3120.8682 3126.0376 3167.2674 3223.0904 3537.4692 3571.3647
redmass: 4.6671 1.0455 4.5360 5.8307 3.9158 6.6648 3.8379 4.4316 3.8043 5.4759 3.3162 3.3201 4.0233 1.2789 3.1853 6.1646 1.5533 3.0198 2.3559 6.7516 3.2632 3.6309 4.2664 6.3670 4.9445 5.6026 4.3020 5.3936 5.8004 4.1517 3.4729 6.1031 3.9736 5.3658 1.4183 3.3357 1.4616 2.5131 2.2082 5.0846 2.4472 3.6017 3.3616 3.1358 1.6041 2.0063 2.1661 5.6872 3.0946 1.3527 1.2978 1.8233 1.2773 1.5259 1.6482 1.9709 1.6757 3.7324 3.1390 1.4591 1.8327 2.2287 1.3299 1.8132 2.3140 1.1906 1.2719 1.7373 1.4401 2.8703 1.1314 1.0525 1.2139 1.0787 7.9936 9.4168 1.0551 1.0376 1.1061 1.0703 1.0811 1.0960 1.0866 1.0894 1.1025 1.0999 1.0921 1.1012 1.0659 1.0667
irintensity: 3.7937 0.4482 0.1121 0.5416 5.0951 3.6817 12.1923 6.4587 17.0666 1.0897 17.1946 2.5141 7.0089 158.2361 6.5173 6.2483 85.9599 39.6377 7.0720 11.0739 20.3903 2.0236 4.0778 5.6978 0.6962 21.4381 16.3735 0.3701 10.2540 12.7588 16.3114 2.7979 15.8214 11.7044 17.0637 54.3252 9.4253 32.2922 0.9793 62.3311 31.7991 11.0830 127.8963 33.6595 6.2089 29.7960 10.5656 21.6144 24.7383 58.4373 49.5907 78.6663 24.6956 9.9111 8.6056 78.9311 7.0518 9.1214 20.1985 16.1362 13.0045 57.7614 13.6364 47.9870 0.6730 28.6967 25.9626 26.5384 0.5144 28.4946 7.6262 21.6231 44.5322 8.5018 42.4265 129.7944 40.8232 6.8500 56.7243 10.9498 9.3549 11.0222 16.2955 22.9321 7.9689 11.5474 15.5935 31.8573 11.5712 8.8805
temp: 298.150 k
press: 1.00000 atm
elementType: 8 8 8 7 7 7 7 6 6 6 6 6 6 6 6 6 6 6 1 1 1 1 1 1 1 1 1 1 1 1 1 1
symmnumber: 1
zpe: 654523.8 jmol-1
zpe.correction: 0.249295 hartree
zpe.thermalcorrener: 0.265748 hartree
zpe.thermalcorrenthalpy: 0.266692 hartree
zpe.thermalcorrgfe: 0.203741 hartree
zpe.sumelectzpe: -870.875995 hartree
zpe.sumelectthermal: -870.859541 hartree
zpe.sumelectthermalent: -870.858597 hartree
zpe.sumelectthermalfe: -870.921549 hartree
dipole: -2.5557 1.0104 2.2153
dipole: 3.5299
quadrupole: -116.6599 -107.5957 -101.2212
quadrupole: -2.1675 -4.9678 9.9884
quadrupole: -8.1676 0.8965 7.2711 -2.1675 -4.9678 9.9884
hfenergy: -871.1252895 hartree
pointgroup: C01 [X(C11H14N4O3)]
dipole: -1.0761777 0.343965 0.8075786 debye
polarizability: 196.2083236|2.3629869|157.9502009|13.521822|-5.6638916|98.1574415 unknown
InChI: InChI=1S/C11H14N4O3/c1-6-10-11(13-4-12-6)15(5-14-10)9-2-7(17)8(3-16)18-9/h4-5,7-9,16-17H,2-3H2,1H3
charge 0 multiplicity 1
32 atoms
O  -2.353683 -0.045435 -1.227852
O  -4.072904 -2.260273 -0.041031
O  -2.999297 2.50226 -0.020294
N  -0.062801 0.035489 -0.506829
N  1.242188 1.929261 -0.435712
N  1.632094 -1.647843 0.158683
N  3.826449 -0.621406 0.58475
C  -1.227887 -0.855324 -0.761416
C  -3.223572 -1.260496 0.615115
C  -1.711174 -1.607035 0.514971
C  -3.318507 0.109815 -0.095419
C  -2.993052 1.297845 0.818119
C  1.211483 -0.386168 -0.122667
C  0.018942 1.429209 -0.697061
C  2.013664 0.802231 -0.077447
C  3.373579 0.643791 0.296341
C  2.955916 -1.679283 0.502212
C  4.337485 1.795578 0.385204
H  -0.951444 -1.536295 -1.584038
H  -3.588598 -1.240459 1.65402
H  -1.157947 -1.254213 1.400776
H  -1.564484 -2.69444 0.43648
H  -4.299003 0.266471 -0.572752
H  -2.00844 1.163996 1.314115
H  -3.779332 1.349994 1.601864
H  -0.85497 2.002601 -1.002985
H  -3.864261 -2.265168 -1.011655
H  -2.885536 3.304603 0.548678
H  3.369943 -2.662863 0.742714
H  3.967503 2.562747 1.089773
H  5.322466 1.432757 0.715143
H  4.43778 2.296054 -0.595599
