program: Gaussian 09
title: 000097188
version: EM64L-G09RevD.01
frameworkgroup: C1[X(C10H14N6O3)]
method: RPBEPBE
basis: SDD
operation: Freq
keyword: #p
keyword: freq=noraman
keyword: PBEPBE/SDD
title: #p freq=noraman PBEPBE/SDD
converged: YES YES NO NO
title: Mulliken charges:
elementType: O O O N N N N N N C C C C C C C C C C H H H H H H H H H H H H H H
charge: -0.247909 -0.428649 -0.443630 -0.225297 -0.089108 -0.091245 -0.115512 -0.623698 -0.593556 -0.073293 -0.141297 -0.516429 -0.106694 -0.360743 0.165888 -0.223310 -0.135950 0.178254 -0.024475 0.267426 0.244453 0.259976 0.272273 0.283678 0.223281 0.209677 0.316036 0.350273 0.353689 0.342451 0.324535 0.322311 0.326596
chargesum: 0.00000
title: Mulliken charges with hydrogens summed into heavy atoms:
elementType: O O O N N N N N N C C C C C C C C C C
charge: -0.247909 -0.078377 -0.089942 -0.225297 -0.089108 -0.091245 -0.115512 0.043288 0.055350 0.194133 0.103156 0.015820 0.176985 0.072215 0.165888 0.092726 -0.135950 0.178254 -0.024475
polarizability: 2.06177167e+02 -3.53351264e+00 1.78743665e+02 -1.33566339e+01 3.88204325e+00 9.63940914e+01
1716.lowfreq: -5.9054 0.0003 0.0007 0.0009 5.7797 7.8196 19.9634 43.3358 64.9993
frequency: 19.7137 43.3163 64.9907 91.1990 99.4696 137.4430 143.7660 184.5444 195.7800 224.5913 235.7511 259.5681 264.1668 287.5616 325.8123 339.5593 347.1742 386.9345 403.5963 414.7955 456.6787 484.9510 486.7903 509.8529 513.5296 540.6987 558.7621 607.2282 628.7693 652.3492 659.3218 692.5576 716.0306 721.1159 758.5560 784.3871 792.1372 801.0790 823.3068 845.6967 902.7571 919.8890 929.2655 965.7510 979.8756 1011.3638 1015.4743 1030.2141 1044.5064 1061.1701 1068.6528 1127.0429 1155.4990 1178.6745 1184.5776 1190.7410 1212.7210 1224.2671 1240.0025 1257.1607 1267.8138 1282.7811 1291.9976 1302.3831 1338.8744 1340.8290 1350.0442 1381.9332 1383.5229 1414.3120 1430.4993 1455.0450 1457.3172 1468.7445 1488.3019 1564.7441 1579.9461 1597.8307 1631.2045 2942.0998 3000.0001 3038.8145 3050.9714 3083.9094 3088.0120 3120.6720 3246.4188 3537.3091 3544.1902 3568.4210 3573.1778 3700.1689 3728.7856
redmass: 4.9517 5.4879 5.8423 5.2109 4.5360 6.2931 3.6879 3.8387 4.8003 6.4469 1.3410 3.2033 2.9212 3.8335 4.6548 4.3067 3.9336 1.4441 3.7646 1.2103 2.5154 1.2518 5.5232 2.9162 1.0769 1.0618 5.6620 4.1373 4.9006 6.1571 8.7126 3.9623 11.3606 5.6214 4.3379 6.9889 3.8003 6.4643 1.4390 3.1833 3.6212 2.8082 2.4154 5.2521 2.5257 4.2493 3.1345 3.2006 2.9928 2.0154 1.9680 2.0707 1.3148 2.1626 2.4705 1.3437 1.2344 1.3790 1.4100 3.0591 1.5585 3.6052 1.4428 1.5531 2.8611 1.7625 1.2575 2.9018 1.4901 1.4473 3.6742 3.4619 1.2552 1.0808 3.0397 3.0795 3.7797 1.4519 2.4356 1.0574 1.1033 1.0872 1.0636 1.0864 1.0896 1.1031 1.0994 1.0658 1.0440 1.0439 1.0667 1.1057 1.1059
irintensity: 3.2482 0.1480 0.5498 2.5332 6.5776 5.0867 22.9282 22.7662 10.9379 4.2611 144.1936 15.3415 25.6949 7.2768 9.1264 3.1335 9.5634 105.2024 15.0105 250.6799 6.5218 288.7214 15.7712 26.0213 25.6399 2.5079 1.2902 6.5140 28.7190 3.0248 6.3804 15.3940 8.0030 7.5824 13.8678 29.6252 7.5462 4.7189 16.3811 26.3339 59.4477 9.4735 28.3566 71.5774 32.9400 19.2938 95.1261 18.7606 32.4601 18.6618 27.2587 0.3871 76.9565 27.3296 30.0704 13.3236 31.6046 2.5907 21.4374 128.5730 3.9499 2.4955 13.7493 26.7949 65.1820 36.5236 23.1609 57.6845 29.8757 1.4180 28.1650 55.0508 62.2816 7.4987 98.5899 178.0935 196.1418 523.4419 502.3749 45.7035 51.0112 20.1564 3.7789 14.8270 27.4022 9.5029 17.7038 10.8276 107.5361 111.5407 6.6787 45.5062 43.1432
temp: 298.150 k
press: 1.00000 atm
elementType: 8 8 8 7 7 7 7 7 7 6 6 6 6 6 6 6 6 6 6 1 1 1 1 1 1 1 1 1 1 1 1 1 1
symmnumber: 1
zpe: 672625.6 jmol-1
zpe.correction: 0.256190 hartree
zpe.thermalcorrener: 0.273611 hartree
zpe.thermalcorrenthalpy: 0.274555 hartree
zpe.thermalcorrgfe: 0.210615 hartree
zpe.sumelectzpe: -942.227698 hartree
zpe.sumelectthermal: -942.210276 hartree
zpe.sumelectthermalent: -942.209332 hartree
zpe.sumelectthermalfe: -942.273272 hartree
dipole: -1.3349 0.6219 2.5242
dipole: 2.9224
quadrupole: -106.7298 -104.0593 -107.4038
quadrupole: -3.4371 2.0220 -7.9510
quadrupole: -0.6655 2.0050 -1.3395 -3.4371 2.0220 -7.9510
hfenergy: -942.4838873 hartree
pointgroup: C01 [X(C10H14N6O3)]
dipole: 0.5043654 0.1117263 -1.027154 debye
polarizability: 205.3560581|-0.362545|177.2150829|-17.8417296|-9.9625745|98.7437821 unknown
InChI: InChI=1S/C10H14N6O3/c11-8-7-9(15-10(12)14-8)16(3-13-7)6-1-4(18)5(2-17)19-6/h3-6,17-18H,1-2,11-12H2
charge 0 multiplicity 1
33 atoms
O  -2.646476 0.039539 1.223385
O  -4.060655 2.465668 0.082325
O  -3.436155 -2.349709 -0.266556
N  -0.326079 -0.224349 0.65114
N  0.812819 -2.218229 0.63856
N  1.503761 1.29966 -0.063912
N  3.614117 0.067026 -0.460253
N  3.801243 -2.267444 -0.172284
N  3.469158 2.379975 -0.752895
C  -1.407283 0.759618 0.914489
C  -3.228592 1.455041 -0.583572
C  -1.712439 1.667689 -0.314516
C  -3.497946 0.046655 -0.006201
C  -3.171221 -1.093725 -0.977022
C  0.981078 0.081241 0.253466
C  -0.36573 -1.618911 0.885664
C  1.663993 -1.164775 0.247284
C  3.038942 -1.128225 -0.131616
C  2.832983 1.204572 -0.410741
H  -1.139558 1.331493 1.819639
H  -3.49219 1.55198 -1.648416
H  -1.097606 1.365392 -1.177346
H  -1.501256 2.72772 -0.109112
H  -4.532495 -0.062922 0.357241
H  -2.116134 -1.037488 -1.315941
H  -3.836368 -0.990252 -1.86224
H  -1.284623 -2.104866 1.204113
H  -3.943696 2.366633 1.063207
H  -3.172295 -3.114606 -0.837028
H  3.382008 -3.15859 0.083542
H  4.780987 -2.20279 -0.437829
H  2.949495 3.251906 -0.724225
H  4.451912 2.351072 -1.00665
