program: Gaussian 09
title: 000097129
version: EM64L-G09RevD.01
frameworkgroup: C1[X(C15H11N3)]
method: RPBEPBE
basis: SDD
operation: Freq
keyword: #pfreq=noraman
keyword: PBEPBE/SDD
title: #p freq=noraman PBEPBE/SDD
converged: YES YES NO NO
title: Mulliken charges:
elementType: N N N C C C C C C C C C C C C C C C H H H H H H H H H H H
charge: 0.015210 0.004609 0.001814 0.421187 -0.094450 -0.316980 0.144914 -0.386355 -0.308235 -0.310989 -0.243164 -0.220481 -0.400139 0.264818 -0.307106 -0.441568 -0.159704 -0.340976 0.246826 0.236759 0.231684 0.272071 0.233018 0.235631 0.223405 0.265429 0.256607 0.233027 0.243140
chargesum: 0.00000
title: Mulliken charges with hydrogens summed into heavy atoms:
elementType: N N N C C C C C C C C C C C C C C C
charge: 0.015210 0.004609 0.001814 0.421187 -0.094450 -0.070155 0.144914 -0.149595 -0.076552 -0.038918 -0.010146 0.015150 -0.176734 0.264818 -0.041676 -0.184962 0.073323 -0.097836
polarizability: 4.04469335e+02 5.80641500e+00 1.73719573e+02 -3.80498557e+00 3.71033645e+00 8.39096491e+01
1716.lowfreq: -6.1006 -4.7338 -0.0006 -0.0004 0.0005 1.9582 30.6218 39.1148 49.1425
frequency: 30.5439 39.1110 49.1354 102.6507 137.3907 170.6799 185.9224 235.6203 270.3967 321.5200 390.1204 404.5243 407.8407 465.3395 478.6533 485.8980 514.5570 528.7697 549.2460 592.4864 611.8197 631.1646 685.1021 713.8028 735.5666 765.4573 766.8874 799.8055 809.3320 825.0903 843.3233 888.6502 893.5593 910.6349 926.4565 962.3252 966.4692 972.8125 982.9385 988.9415 996.5216 1000.6447 1015.3116 1026.1957 1102.5458 1113.3698 1149.5620 1166.8812 1172.0721 1196.7932 1225.9747 1247.0254 1253.4931 1299.7944 1305.3903 1325.2524 1355.8882 1388.8649 1399.6816 1403.6469 1420.3854 1450.8774 1461.2517 1502.3976 1530.4136 1539.0193 1565.4863 1587.6534 1612.8755 1630.0161 2938.7518 3115.1097 3122.7650 3127.2745 3136.3476 3139.7527 3151.1837 3155.0153 3157.5068 3173.3290 3174.5324
redmass: 4.7112 5.5864 5.5191 5.4780 6.1659 4.0176 3.6681 4.7153 4.5957 3.9222 4.6996 3.5418 3.2466 4.5960 3.1880 6.4215 6.6420 4.2314 3.7770 7.8571 7.7679 7.2484 3.1157 1.9328 5.4220 1.3211 5.5277 2.9620 2.5827 3.2414 1.4376 1.6813 1.4121 5.2699 1.4579 4.3644 1.4120 1.5746 1.3976 1.4351 3.5559 1.3360 2.1602 2.8988 1.5234 1.7448 1.2414 1.1642 2.4523 1.3708 1.9283 2.2850 1.8926 2.8551 4.7692 1.4742 4.2236 1.4818 2.0755 4.7707 2.1962 2.2069 2.9847 3.5025 5.3339 7.2012 6.4833 6.4583 6.4181 7.0714 1.0858 1.0907 1.0875 1.0874 1.0879 1.0895 1.0984 1.0928 1.0951 1.0992 1.0998
irintensity: 1.5096 0.9639 0.4726 1.4023 1.0408 13.8537 3.8297 3.6768 4.3967 3.4259 0.1988 0.3582 2.2400 8.8375 8.6589 7.8679 0.5467 0.7550 1.3467 9.9926 0.9385 0.6187 1.1382 34.0434 0.6615 63.3238 16.8183 2.1915 13.6961 23.0841 79.1214 2.3829 15.9264 12.3548 3.5093 15.2244 0.4894 23.5765 5.0385 0.4084 18.8967 0.1345 9.5288 0.6394 10.0301 10.6371 1.2494 1.5109 12.3711 2.2120 5.0158 16.7543 7.2032 7.2809 1.6428 6.2379 9.2956 4.8101 11.8569 7.3961 17.7238 26.2050 0.5704 34.4691 10.3488 4.0304 9.2377 7.0325 32.8425 23.1418 53.2667 15.6236 4.9428 6.2605 4.2220 11.3740 19.9818 27.6867 26.5465 23.0554 20.7041
temp: 298.150 k
press: 1.00000 atm
elementType: 7 7 7 6 6 6 6 6 6 6 6 6 6 6 6 6 6 6 1 1 1 1 1 1 1 1 1 1 1
symmnumber: 1
zpe: 579455.5 jmol-1
zpe.correction: 0.220703 hartree
zpe.thermalcorrener: 0.234401 hartree
zpe.thermalcorrenthalpy: 0.235345 hartree
zpe.thermalcorrgfe: 0.178474 hartree
zpe.sumelectzpe: -741.211032 hartree
zpe.sumelectthermal: -741.197334 hartree
zpe.sumelectthermalent: -741.196390 hartree
zpe.sumelectthermalfe: -741.253261 hartree
dipole: -3.4762 1.0839 -1.6976
dipole: 4.0175
quadrupole: -86.8978 -93.7661 -108.7345
quadrupole: -9.9173 -8.5773 -0.9315
quadrupole: 9.5684 2.7001 -12.2684 -9.9173 -8.5773 -0.9315
hfenergy: -741.4317351 hartree
pointgroup: C01 [X(C15H11N3)]
dipole: 1.3807685 0.6277534 0.4447001 debye
polarizability: 404.1830454|-10.1398591|158.9542499|-5.5186329|-33.5292159|98.9612612 unknown
InChI: InChI=1S/C15H11N3/c1-2-6-15-12(4-1)7-8-14(18-15)11-17-13-5-3-9-16-10-13/h1-11H
charge 0 multiplicity 1
29 atoms
N  1.183342 -0.441415 0.179629
N  -1.682627 -0.230916 0.270366
N  -5.13051 0.565447 -0.97738
C  3.361413 0.719708 -0.168228
C  2.565395 -0.460084 0.128536
C  2.65645 1.94252 -0.41352
C  0.553712 0.734822 -0.058541
C  4.788251 0.612189 -0.202025
C  1.264386 1.952643 -0.359811
C  3.231824 -1.704763 0.380483
C  5.408737 -0.614537 0.04747
C  4.625301 -1.778906 0.340093
C  -0.925304 0.794581 -0.018365
C  -3.088425 -0.146227 0.192834
C  -3.878037 -0.812837 1.170433
C  -3.775497 0.504813 -0.879806
C  -5.281632 -0.748987 1.076526
C  -5.86869 -0.037534 0.001471
H  3.217318 2.856433 -0.640499
H  5.386848 1.503439 -0.426047
H  0.700071 2.873614 -0.543152
H  2.607909 -2.576202 0.600277
H  6.501083 -0.692946 0.020455
H  5.129556 -2.732084 0.532546
H  -1.35246 1.798702 -0.233638
H  -3.3751 -1.354486 1.977124
H  -3.20723 0.94731 -1.708087
H  -5.916486 -1.242111 1.819469
H  -6.956401 0.051516 -0.093313
