program: Gaussian 09
title: 000097128
version: EM64L-G09RevD.01
frameworkgroup: C1[X(C15H11N3)]
method: RPBEPBE
basis: SDD
operation: Freq
keyword: #pfreq=noraman
keyword: PBEPBE/SDD
title: #p freq=noraman PBEPBE/SDD
converged: NO YES NO NO
title: Mulliken charges:
elementType: N N N C C C C C C C C C C C C C C C H H H H H H H H H H H
charge: -0.012178 -0.061666 -0.001558 0.440027 -0.051171 -0.419467 0.247445 -0.399521 -0.299046 -0.478527 -0.245471 -0.221528 0.447321 -0.362428 -0.310160 -0.305835 -0.334857 -0.331306 0.257661 0.235041 0.263105 0.262561 0.231501 0.233879 0.223686 0.229371 0.273500 0.244186 0.245436
chargesum: 0.00000
title: Mulliken charges with hydrogens summed into heavy atoms:
elementType: N N N C C C C C C C C C C C C C C C
charge: -0.012178 -0.061666 -0.001558 0.440027 -0.051171 -0.161806 0.247445 -0.164480 -0.035941 -0.215966 -0.013971 0.012351 0.447321 -0.138742 -0.080789 -0.032335 -0.090671 -0.085870
polarizability: 4.03063774e+02 7.28493660e+00 1.71063852e+02 1.44383374e-01 -5.05761538e+00 8.35915630e+01
1716.lowfreq: -3.6491 -1.0426 0.0003 0.0005 0.0006 4.2628 33.8159 42.0927 48.8477
frequency: 33.8008 42.0783 48.8365 107.8521 139.4849 177.9993 184.6139 259.3857 266.6672 322.8543 369.0427 371.9785 421.1622 467.0489 478.8305 487.0422 513.7651 530.2312 551.5972 600.1892 618.0310 658.2505 661.5915 733.2630 744.3530 759.0834 763.8703 796.0178 825.6261 849.2561 871.6891 890.9312 891.4475 908.2886 929.1240 956.7997 962.1606 969.3745 971.5183 984.6953 993.9574 996.8990 1017.9609 1054.5868 1080.3801 1113.8771 1147.5987 1170.3356 1200.7224 1209.0251 1234.5277 1253.1048 1268.7873 1298.3511 1324.5225 1348.8701 1360.9282 1376.9821 1388.2898 1404.2147 1423.9143 1451.0656 1465.8076 1483.3881 1546.3177 1553.7714 1570.3037 1586.7792 1605.7791 1624.7428 2952.4847 3120.8650 3125.5822 3125.8920 3135.8605 3138.6175 3140.0253 3149.9236 3156.1537 3172.1929 3172.9782
redmass: 4.1301 5.4473 5.7362 5.3924 5.6036 6.1396 3.9603 3.4403 4.9706 5.2955 2.5326 4.7285 3.8286 5.3574 2.9842 5.5650 5.6393 4.7472 4.0031 6.7060 7.5932 3.9780 4.1799 7.2234 3.2815 5.4143 1.3744 2.7166 1.3500 3.5492 1.4988 1.9475 2.0277 1.8134 1.4820 6.6721 1.5328 1.3895 3.2360 1.6052 1.5042 1.3322 2.1440 2.0648 1.5980 1.8093 2.0082 1.2361 2.0833 1.4047 1.8100 1.9813 1.5882 5.8396 1.6620 1.9356 2.0305 2.2158 2.9616 2.0359 5.0374 2.5824 2.1591 3.4225 7.7885 7.2938 5.7082 5.6708 6.6212 6.7739 1.0868 1.0877 1.0913 1.0879 1.0919 1.0892 1.0894 1.0976 1.0949 1.0993 1.0966
irintensity: 0.6831 0.2782 0.4144 3.3860 4.6356 0.8093 1.6582 7.7817 5.0973 4.2126 0.1094 1.9215 15.9981 14.5857 7.5846 12.0856 8.5099 7.0832 5.8615 1.5045 25.8568 0.9433 0.9242 9.5863 2.4069 0.8652 61.4520 19.1337 37.2843 5.7989 13.1397 6.1374 1.3307 35.3778 10.4273 1.5449 8.9186 6.4810 13.2477 8.1706 9.6988 0.1757 5.3459 7.1969 1.7528 7.8454 24.6346 2.8256 4.5026 0.2446 15.9570 1.2501 5.1214 7.0021 10.1802 12.1740 4.4475 1.2113 6.6042 20.4938 0.6066 4.8691 5.3779 18.6569 13.8448 8.4141 0.3111 44.4437 24.8521 20.4737 44.0310 1.8865 11.9834 3.9870 7.5458 8.7476 25.5140 28.7871 23.6088 29.6594 6.2321
temp: 298.150 k
press: 1.00000 atm
elementType: 7 7 7 6 6 6 6 6 6 6 6 6 6 6 6 6 6 6 1 1 1 1 1 1 1 1 1 1 1
symmnumber: 1
zpe: 580584.8 jmol-1
zpe.correction: 0.221133 hartree
zpe.thermalcorrener: 0.234766 hartree
zpe.thermalcorrenthalpy: 0.235710 hartree
zpe.thermalcorrgfe: 0.179139 hartree
zpe.sumelectzpe: -741.216338 hartree
zpe.sumelectthermal: -741.202705 hartree
zpe.sumelectthermalent: -741.201761 hartree
zpe.sumelectthermalfe: -741.258331 hartree
dipole: 1.9326 3.4606 -0.3388
dipole: 3.9782
quadrupole: -113.3670 -97.0375 -107.0358
quadrupole: 5.6787 3.4359 -2.6854
quadrupole: -7.5536 8.7759 -1.2224 5.6787 3.4359 -2.6854
hfenergy: -741.4374708 hartree
pointgroup: C01 [X(C15H11N3)]
dipole: -0.7688143 -1.1952371 -0.6557112 debye
polarizability: 403.1413916|5.7234856|153.7620844|1.6109546|35.127359|100.8157126 unknown
InChI: InChI=1S/C15H11N3/c1-2-4-15-13(3-1)9-14(11-18-15)17-10-12-5-7-16-8-6-12/h1-11H
charge 0 multiplicity 1
29 atoms
N  -2.554682 1.896963 0.407371
N  0.903111 0.585055 0.36232
N  5.98727 -0.215727 0.087866
C  -2.678913 -0.547851 -0.050092
C  -3.301248 0.747659 0.150991
C  -1.252097 -0.620909 -0.001291
C  -0.50399 0.544929 0.241156
C  -3.513234 -1.689563 -0.285545
C  -4.725028 0.857272 0.107594
C  -1.221579 1.78086 0.459759
C  -4.90277 -1.553254 -0.328617
C  -5.512849 -0.273172 -0.130857
C  3.146397 -0.144881 -0.230068
C  1.683819 -0.127112 -0.410674
C  3.964153 -0.913105 -1.100841
C  3.785786 0.589738 0.806301
C  5.362956 -0.917848 -0.904331
C  5.188144 0.523501 0.921947
H  -0.753355 -1.591533 -0.113531
H  -3.045763 -2.670581 -0.434813
H  -5.162951 1.847476 0.266366
H  -0.641977 2.685964 0.674878
H  -5.534587 -2.429154 -0.512229
H  -6.604117 -0.18411 -0.165269
H  1.288944 -0.730026 -1.256415
H  3.520723 -1.496271 -1.916661
H  3.18039 1.190244 1.4914
H  6.019308 -1.501017 -1.559844
H  5.71244 1.077251 1.708527
