program: Gaussian 09
title: 000097122
version: EM64L-G09RevD.01
frameworkgroup: C1[X(C5H6Cl2N4O)]
method: RPBEPBE
basis: SDD
operation: Freq
keyword: #p
keyword: freq=noraman
keyword: PBEPBE/SDD
title: #p freq=noraman PBEPBE/SDD
converged: YES YES NO NO
title: Mulliken charges:
elementType: Cl Cl O N N N N C C C C C H H H H H H
charge: 0.029594 0.029913 -0.197904 -0.057295 0.017374 -0.016001 0.109695 0.199503 -0.606935 -0.498248 -0.251949 -0.254684 0.283262 0.236557 0.252865 0.216949 0.267789 0.239514
chargesum: 0.00000
title: Mulliken charges with hydrogens summed into heavy atoms:
elementType: Cl Cl O N N N N C C C C C
charge: 0.029594 0.029913 -0.197904 -0.057295 0.017374 -0.016001 0.109695 0.199503 0.165750 0.226003 -0.251949 -0.254684
polarizability: 1.51084821e+02 2.54423250e-01 1.33818108e+02 -1.03429944e+00 -4.59824839e-01 5.19003381e+01
1716.lowfreq: -6.8687 -5.9328 0.0019 0.0021 0.0026 4.0569 57.5893 90.1166 99.8163
frequency: 57.5802 90.1149 99.8157 138.5150 142.7907 148.9403 177.7142 188.1673 192.5889 210.7168 314.6602 325.9464 394.1561 429.9983 441.6051 516.5478 572.3780 617.0518 657.2953 761.9400 778.4668 788.5031 873.3589 896.6716 986.8074 1101.8316 1114.2410 1124.8231 1150.9287 1174.6197 1185.4421 1191.2134 1287.8517 1378.7152 1411.5156 1414.0717 1439.0026 1461.9643 1467.5833 1477.1158 1478.8149 1564.5837 2987.2777 2996.7529 3085.7464 3100.5966 3133.3997 3135.4433
redmass: 4.0340 2.9361 3.3465 2.4767 2.3025 2.1018 7.5818 5.3111 2.0816 3.8246 7.7648 4.6814 10.6645 7.7338 6.4920 5.4111 7.7697 12.3374 12.1181 7.0424 12.6910 12.7489 9.8374 6.5009 4.0921 1.2760 3.8037 1.4476 1.7517 3.2511 5.7106 4.4298 12.2221 5.8525 1.2816 1.1764 1.0587 1.6145 1.2011 1.0583 2.1069 4.8333 1.0294 1.0338 1.1025 1.1044 1.1046 1.1000
irintensity: 0.5981 1.8648 6.5183 0.1061 1.6044 1.0098 0.9528 1.3243 3.2123 1.4114 6.2339 4.1433 3.0594 10.0878 13.9061 3.0959 17.3428 0.0389 4.1075 32.7060 10.7519 146.1367 3.1505 71.3511 31.4800 3.4218 68.0236 13.2291 23.2730 94.0957 120.9162 58.0299 115.2092 483.8791 22.3246 19.8566 10.4763 102.8249 115.6626 23.5351 399.6500 523.3303 44.8231 42.6883 18.0993 20.8188 11.9426 0.9176
temp: 298.150 k
press: 1.00000 atm
elementType: 17 17 8 7 7 7 7 6 6 6 6 6 1 1 1 1 1 1
symmnumber: 1
zpe: 309030.5 jmol-1
zpe.correction: 0.117704 hartree
zpe.thermalcorrener: 0.130050 hartree
zpe.thermalcorrenthalpy: 0.130994 hartree
zpe.thermalcorrgfe: 0.077964 hartree
zpe.sumelectzpe: -1407.503231 hartree
zpe.sumelectthermal: -1407.490884 hartree
zpe.sumelectthermalent: -1407.489940 hartree
zpe.sumelectthermalfe: -1407.542970 hartree
dipole: 4.8148 -1.8335 1.3181
dipole: 5.3181
quadrupole: -80.1441 -83.3402 -82.0216
quadrupole: -2.4517 5.3321 1.9596
quadrupole: 1.6912 -1.5049 -0.1863 -2.4517 5.3321 1.9596
hfenergy: -1407.6209344 hartree
pointgroup: C01 [X(C5H6Cl2N4O1)]
dipole: -1.9174187 -0.4801025 -0.6860505 debye
dipolederiv: -0.5118663 0.4097822 -0.0589657 0.472875 -0.5823807 0.0657029 -0.0570928 0.0524218 -0.0708531 -0.2123066 -0.2477625 0.0002815 -0.3255241 -0.8585866 0.0185185 0.0128672 0.0434851 -0.0651188 -0.3365346 -0.0464089 -0.0931727 0.1088915 -0.4109074 0.1718359 -0.0181483 0.1300952 -0.2492442 -0.9286255 -0.2611802 -0.0211738 -0.5484518 -0.0179251 -0.0254878 -0.3593552 -0.0439052 -0.3169995 -1.3740828 -0.4399064 -0.0896524 -0.6940239 -0.8770017 -0.0219812 -0.0734875 0.0224109 -0.1504681 -1.7429204 0.1610619 -0.1514012 0.2984355 -0.6012168 0.0626821 -0.0767477 0.0433968 -0.1601046 -0.7891886 0.2042553 -0.074468 0.1774621 -1.7115076 0.1094329 -0.0515136 0.1085992 -0.1032702 2.1295692 0.2368554 0.194045 0.4069061 0.6018313 0.0207747 0.1949632 -0.0226944 0.2289053 0.0857717 0.197042 -0.0593246 0.4211102 0.2455432 -0.0095849 0.0325353 -0.0066741 0.2364796 0.2008712 0.005003 0.0549792 -0.1308099 0.2890699 -0.1090203 0.2685283 -0.1319237 0.4122567 1.7862643 -0.3475905 0.1525357 -0.4583061 1.7259976 -0.1229139 0.1219565 -0.1053636 0.085704 1.5105662 0.2184558 0.1035721 0.3896628 1.9857342 -0.0764328 0.0684791 -0.1125075 0.0833308 0.1048903 0.0901236 0.0147638 0.0627581 0.0473824 0.0138125 0.0100719 0.0061985 0.1349527 -0.0249576 -0.0888896 -0.0891328 -0.0779463 0.0694033 0.0120274 -0.1251553 -0.0346287 -0.0281203 0.0220426 -0.0676661 0.0785293 -0.097571 0.0571689 -0.0369995 0.1347305 0.0398063 -0.0579015 0.0838857 -0.0284704 -0.04983 -0.069438 -0.0329276 -0.1202397 -0.1136103 -0.0281309 -0.089553 0.0226901 -0.1068731 0.0805121 -0.0653521 0.0430096 0.0396649 0.0149837 0.0429037 0.0445503 -0.026069 0.1121687 0.0079027 0.129322 0.0273133 0.0082083 0.0159951 -0.0034895 0.0654539 unknown
polarizability: 149.5900203|-2.0140562|133.5424047|10.0217342|-8.0608819|53.6708419 unknown
InChI: InChI=1S/C5H6Cl2N4O/c1-11(12-2)5-9-3(6)8-4(7)10-5/h1-2H3
charge 0 multiplicity 1
18 atoms
Cl 2.956863 -2.348214 0.39354
Cl 1.917276 2.910626 -0.00019
O  -2.686245 0.503542 0.105401
N  -1.738853 -0.576635 -0.017694
N  -0.004055 1.03677 0.001618
N  0.471142 -1.355436 0.186824
N  2.28424 0.252647 0.204916
C  -0.406009 -0.286606 0.069923
C  -2.334796 -1.901862 0.173306
C  -2.859021 1.21716 -1.192418
C  1.762876 -1.00324 0.243555
C  1.3243 1.207731 0.078609
H  -1.526604 -2.647245 0.148761
H  -3.060864 -2.10306 -0.632495
H  -2.852145 -1.944848 1.148271
H  -3.15752 0.512081 -1.989351
H  -1.93002 1.750022 -1.451905
H  -3.670764 1.931468 -0.985373
