program: Gaussian 09
title: 000097117
version: EM64L-G09RevD.01
frameworkgroup: C1[X(C13H10OS)]
method: RPBEPBE
basis: SDD
operation: Freq
keyword: #p
keyword: freq=noraman
keyword: PBEPBE/SDD
title: #p freq=noraman PBEPBE/SDD
converged: YES YES NO NO
title: Mulliken charges:
elementType: S O C C C C C C C C C C C C C H H H H H H H H H H
charge: 0.123861 -0.157476 0.405662 -0.117554 -0.348961 -0.304890 -0.244383 -0.189474 -0.264736 -0.219698 -0.231684 -0.220823 -0.224463 -0.208456 -0.229819 0.274539 0.251064 0.258388 0.251685 0.235851 0.234376 0.235514 0.230465 0.230372 0.230641
chargesum: 0.00000
title: Mulliken charges with hydrogens summed into heavy atoms:
elementType: S O C C C C C C C C C C C C C
charge: 0.123861 -0.157476 0.405662 -0.117554 -0.074421 -0.053826 -0.244383 0.068914 -0.013051 0.016153 0.002692 0.014690 0.006003 0.021916 0.000822
polarizability: 2.71072829e+02 3.57207285e+00 1.43044701e+02 5.67734889e+00 -3.09815800e+00 8.17737107e+01
1716.lowfreq: -5.8475 -3.7688 -0.0018 -0.0010 0.0011 5.3021 18.5463 29.9661 40.1936
frequency: 18.4356 29.9131 40.1778 65.9180 147.9471 156.7794 203.0824 255.7021 289.6374 395.9891 399.7983 401.6389 416.2992 425.9288 462.7518 537.1289 609.9210 612.8726 627.0947 663.2584 678.7105 691.2003 691.7661 750.5916 783.4081 842.2256 855.5069 865.1027 916.9641 945.3165 971.3755 985.5447 989.1068 989.4367 994.2130 1007.5029 1016.3540 1026.6482 1074.0006 1076.0552 1089.4800 1172.4654 1175.3299 1184.9283 1188.2601 1205.1610 1305.7762 1321.3703 1377.0905 1388.2017 1426.6146 1436.0142 1461.1797 1477.2626 1580.8381 1588.5239 1589.2427 1606.6609 1621.3078 3129.0769 3131.9853 3140.0600 3141.5737 3151.7253 3152.7816 3162.1211 3164.4371 3172.1441 3175.9972
redmass: 4.4799 5.1381 7.2761 5.5966 6.0750 5.2014 5.1129 5.6619 6.9530 2.8296 4.1047 5.3228 9.6118 3.9349 3.9167 7.4881 6.4705 6.4632 4.9644 7.5675 6.5358 1.8266 2.1072 1.5381 1.8729 1.2497 1.2528 7.3683 1.3750 1.4160 1.3927 5.8883 5.5302 1.4294 1.3439 1.3348 3.3618 2.1910 2.4173 1.5987 1.5766 1.0527 1.0691 1.1939 1.2889 2.3172 1.3065 1.3122 9.7366 9.0135 2.1107 2.2621 2.0743 2.1661 6.5016 6.0716 6.2798 6.0633 10.5307 1.0850 1.0853 1.0889 1.0883 1.0927 1.0938 1.0963 1.0980 1.1013 1.0990
irintensity: 0.3314 0.8247 1.2388 1.5895 1.2928 0.1951 0.8976 4.9981 12.3775 0.1027 2.1010 3.2353 0.1107 0.9318 5.8150 9.0990 0.1995 2.1282 18.5237 93.8230 7.2696 36.7094 59.5612 77.6154 46.4534 2.4808 0.2704 220.2390 1.1440 3.6099 0.6586 6.1246 1.5926 0.3911 0.1178 0.2423 19.0854 2.5217 7.7219 8.0448 10.5278 0.0553 7.3695 58.2641 75.2415 113.6639 2.2851 2.8262 0.9000 4.3116 13.1823 15.9097 29.4508 3.7762 33.5127 13.7817 3.1304 19.6090 106.0203 0.1774 0.2044 7.7634 7.3882 15.3552 24.7558 13.6195 28.0267 23.8560 7.7558
temp: 298.150 k
press: 1.00000 atm
elementType: 16 8 6 6 6 6 6 6 6 6 6 6 6 6 6 1 1 1 1 1 1 1 1 1 1
symmnumber: 1
zpe: 494230.7 jmol-1
zpe.correction: 0.188243 hartree
zpe.thermalcorrener: 0.201167 hartree
zpe.thermalcorrenthalpy: 0.202111 hartree
zpe.thermalcorrgfe: 0.145878 hartree
zpe.sumelectzpe: -973.633724 hartree
zpe.sumelectthermal: -973.620799 hartree
zpe.sumelectthermalent: -973.619855 hartree
zpe.sumelectthermalfe: -973.676088 hartree
dipole: -1.4894 -0.8042 -0.1272
dipole: 1.6974
quadrupole: -67.7867 -90.5451 -96.7301
quadrupole: 1.2701 1.3724 -3.3754
quadrupole: 17.2339 -5.5245 -11.7095 1.2701 1.3724 -3.3754
hfenergy: -973.8219666 hartree
pointgroup: C01 [X(C13H10O1S1)]
dipole: -0.5777954 -0.2156651 0.2561709 debye
dipolederiv: -0.7797747 0.1825182 -0.1440667 0.5122556 -0.2588902 0.1246763 -0.5104252 0.1103576 -0.1963283 -0.7101245 -0.1344994 0.1216527 0.2127043 -0.67262 0.365343 -0.1579215 0.4152771 -0.5609769 -0.7764651 -0.0242868 0.0625703 0.0909314 -0.0355371 0.0300153 -0.1021018 0.0459459 -0.0241322 0.7861734 0.0813092 -0.050505 0.2009385 -0.0656973 0.0330133 -0.2145171 0.055993 0.0031693 0.0602832 0.0964854 -0.0980762 -0.1554846 -0.0303493 -0.0601316 0.1283709 -0.0735636 -0.0440281 0.0480329 -0.060095 0.0414732 0.0596585 -0.0648673 -0.0433779 -0.0716029 -0.0398884 -0.0740839 1.942014 -0.1275302 0.0183699 -0.7818018 0.7663427 -0.5114745 0.7609405 -0.5812763 0.5510944 -0.1945137 0.0253138 0.1341986 -0.1509869 -0.0869164 0.0124386 0.0705682 0.0335011 -0.0274689 -0.3008755 0.0103258 -0.0892605 -0.0182346 -0.1084108 -0.0114791 0.1291256 0.0054453 0.0347128 -0.1174321 -0.1467379 0.1279525 -0.1580578 -0.0498366 -0.0828119 0.153631 -0.0823358 -0.0851442 -0.1880191 0.0957337 -0.0870718 0.1630612 -0.012893 -0.1337105 -0.1291925 -0.1324669 -0.0256868 0.1103181 0.0076435 -0.0243365 0.0124453 -0.0436934 -0.0804605 -0.0301915 -0.0804342 -0.0577723 -0.0584971 0.033267 -0.0914978 0.0257769 -0.12936 -0.0242606 -0.0282642 0.0078955 0.1151402 0.0071259 0.0553295 0.1129061 0.0753811 -0.1298408 0.0443215 0.0391124 0.0315905 0.0300725 0.0413398 0.0731968 -0.0421348 0.056638 -0.1367738 -0.0019279 -0.0104118 -0.010915 -0.0309982 0.1335386 -0.0552234 0.0536155 -0.0278733 0.0762274 0.0715476 0.0213594 0.0757242 0.0843538 0.06616 0.0748947 -0.0589486 0.0914622 0.0847168 0.0568541 -0.0870576 0.0579217 0.10166 0.0488625 -0.0483768 -0.0852438 -0.0336614 0.1155419 -0.0087167 -0.0880631 -0.0277845 0.0344199 0.1189142 -0.026013 0.0730444 -0.0177658 0.1448568 0.0032759 0.0619807 -0.0152188 -0.0403898 -0.0260398 0.0748723 -0.0558116 0.0897109 0.0485076 0.0940798 -0.0669738 0.0948609 0.0775817 0.0354339 -0.0401062 0.0429641 -0.0672751 0.0307211 0.1187144 0.0687324 0.1185587 0.0480508 -0.1285369 -0.0122152 0.0289089 -0.0127761 0.1228949 0.03207 0.0269741 0.0322843 0.1269592 0.033929 -0.0177333 0.0544983 -0.0252965 0.1524843 -0.0001017 0.0867847 -0.0063579 -0.0963371 -0.0362793 -0.0497341 -0.0915085 -0.0640997 0.1426194 -0.0385493 -0.1039081 -0.0415865 -0.0233405 -0.1155676 -0.0683386 0.0463073 -0.07765 0.1407731 0.0106525 0.0530511 0.0064723 0.0794728 unknown
polarizability: 270.8983128|6.6999712|96.9101778|-3.9981422|-26.7765506|128.0827511 unknown
InChI: InChI=1S/C13H10OS/c14-13(11-7-3-1-4-8-11)15-12-9-5-2-6-10-12/h1-10H
charge 0 multiplicity 1
25 atoms
S  0.48787 -1.043081 0.648894
O  -0.110475 0.969656 -1.150137
C  -2.064022 -0.020936 -0.106289
C  2.177715 -0.493169 0.16691
C  -2.942442 0.838337 -0.823598
C  -2.603119 -0.978366 0.793571
C  -0.598337 0.141082 -0.351693
C  2.586972 -0.479856 -1.185584
C  3.078316 -0.143142 1.199267
C  -4.33599 0.740508 -0.64115
C  -3.998792 -1.074444 0.970804
C  -4.867946 -0.216593 0.255879
C  3.912554 -0.10753 -1.503654
C  4.406507 0.21485 0.872135
C  4.824857 0.23554 -0.478476
H  -2.50985 1.570292 -1.513355
H  -1.940286 -1.645563 1.354705
H  1.881349 -0.745927 -1.97719
H  2.7437 -0.146024 2.241714
H  -5.00702 1.405735 -1.195075
H  -4.40936 -1.814914 1.665362
H  -5.951737 -0.293335 0.397305
H  4.230076 -0.089647 -2.551892
H  5.106336 0.482992 1.671136
H  5.853024 0.518137 -0.730287
