program: Gaussian 09
title: 000096963
version: EM64L-G09RevD.01
frameworkgroup: C1[X(C8H10N4OS2)]
method: RPBEPBE
basis: SDD
operation: Freq
keyword: #p
keyword: freq=noraman
keyword: PBEPBE/SDD
title: #p freq=noraman PBEPBE/SDD
converged: NO YES NO NO
title: Mulliken charges:
elementType: S S O N N N N C C C C C C C C H H H H H H H H H H
charge: 0.262188 0.001464 -0.265040 -0.083148 -0.134377 -0.358331 -0.052930 0.108601 0.138325 0.147829 -0.263850 -0.202777 -0.617583 -0.608189 -0.805725 0.345820 0.261826 0.255836 0.261771 0.258436 0.258411 0.267095 0.288455 0.247511 0.288382
chargesum: 0.00000
title: Mulliken charges with hydrogens summed into heavy atoms:
elementType: S S O N N N N C C C C C C C C
charge: 0.262188 0.001464 -0.265040 -0.083148 -0.134377 -0.012512 -0.052930 0.108601 0.138325 0.147829 -0.263850 -0.202777 0.161850 0.175753 0.018623
polarizability: 2.48276420e+02 3.67304166e+00 1.67723730e+02 2.19380195e-02 -1.49155692e-02 6.96625330e+01
1716.lowfreq: -9.5333 -2.0708 -0.0028 -0.0019 -0.0011 5.6545 39.5495 59.2767 88.0569
frequency: 39.5280 59.2739 88.0507 98.7677 111.9481 118.5141 159.8861 184.6168 188.5784 213.3304 213.8063 276.0876 308.8655 317.8659 336.4703 355.8173 379.0911 402.2997 426.7317 474.6758 564.7516 615.0012 628.9267 633.9576 636.0215 657.2072 678.1601 719.4466 737.2369 854.9618 925.2072 947.9911 985.9715 1001.4546 1044.6536 1096.6719 1116.1717 1127.0217 1128.0044 1170.0594 1192.6684 1242.4077 1268.5251 1295.6216 1327.3794 1351.8017 1375.2392 1395.8323 1427.9520 1434.6141 1439.7625 1452.1485 1457.7030 1467.4016 1470.9448 1474.4179 1508.9899 1583.3158 1661.6819 3008.8057 3010.1880 3031.4603 3100.6110 3102.7015 3134.2800 3135.5369 3159.7701 3166.0445 3587.2296
redmass: 3.3628 5.6589 2.9584 1.4161 4.4713 3.6708 1.0688 2.2901 1.4533 4.5021 4.5020 12.4037 3.6849 6.5892 6.0322 6.5401 4.9126 4.9941 7.2894 8.3377 7.2908 8.8864 9.2579 6.8183 1.3955 7.3354 4.7329 4.8504 11.6814 4.9290 8.2723 7.8461 1.1711 1.2758 3.2124 3.3842 2.4605 1.3059 1.3106 1.9126 2.5088 7.3640 5.7905 6.8201 3.5369 1.4696 5.7044 3.2594 1.2504 1.0525 1.2078 1.0636 1.0431 1.0432 1.1088 1.1600 3.5712 8.0711 11.0447 1.0326 1.0324 1.0276 1.1018 1.1017 1.1031 1.1026 1.1049 1.1066 1.0821
irintensity: 2.4744 1.0994 1.7007 0.2519 0.1773 0.1516 0.9371 14.3755 5.5546 1.5344 7.4444 1.1073 8.4707 0.1183 5.3224 0.2435 13.7162 7.3754 25.6396 8.7470 0.1789 2.4894 0.1862 2.2032 97.3645 7.0977 18.2640 0.4761 6.6708 0.2918 17.4134 13.3768 8.1673 12.7858 48.9710 110.0859 109.2254 0.8854 0.0354 18.1509 15.6990 21.2983 136.1804 105.2519 26.9888 9.0548 9.0465 541.3030 123.3233 16.8476 19.5690 40.6727 16.9124 18.7684 38.0950 30.5201 87.4309 101.4210 499.6067 18.5405 17.4370 16.3795 7.2271 15.3887 1.7375 2.0099 5.7995 7.3499 95.6430
temp: 298.150 k
press: 1.00000 atm
elementType: 16 16 8 7 7 7 7 6 6 6 6 6 6 6 6 1 1 1 1 1 1 1 1 1 1
symmnumber: 1
zpe: 480229.6 jmol-1
zpe.correction: 0.182910 hartree
zpe.thermalcorrener: 0.198089 hartree
zpe.thermalcorrenthalpy: 0.199033 hartree
zpe.thermalcorrgfe: 0.139819 hartree
zpe.sumelectzpe: -1400.128706 hartree
zpe.sumelectthermal: -1400.113526 hartree
zpe.sumelectthermalent: -1400.112582 hartree
zpe.sumelectthermalfe: -1400.171796 hartree
dipole: 5.1253 -1.2390 0.0143
dipole: 5.2730
quadrupole: -99.1655 -105.7436 -103.8110
quadrupole: -7.0474 0.0544 0.0203
quadrupole: 3.7412 -2.8369 -0.9043 -7.0474 0.0544 0.0203
hfenergy: -1400.3116154 hartree
pointgroup: C01 [X(C8H10N4O1S2)]
dipole: 2.0517928 0.2940803 -0.0861076 debye
dipolederiv: -0.7538894 -0.167399 0.0297618 0.014027 -0.0268652 -0.001376 0.0253411 0.0057305 -0.0462526 -0.7868426 0.3321515 0.0143445 0.4334308 -0.545487 -0.0105615 0.0139435 -0.0076601 -0.2374975 -0.6356823 -0.1438887 0.0126869 -0.2545098 -1.4078889 0.0275273 0.0140001 0.0230945 -0.3614502 -1.3673579 0.499213 0.0382474 -0.0411105 -0.6406996 0.010808 0.0470069 -0.0081931 -0.0825423 -0.7977687 0.3373686 0.0188142 0.5690698 -1.3755265 0.0004195 0.0135043 0.0098842 -0.1242198 -0.5799463 0.1304182 0.0117844 -0.0563453 -0.5435576 0.0103936 0.0159834 0.0060861 -0.1910226 -1.242595 0.2585924 0.0330198 0.4895475 -0.4586184 -0.0136819 0.0282921 -0.0048437 -0.2169481 -0.5754139 -0.6451276 0.0317392 -0.5732424 -0.3754819 0.0256081 0.0291183 0.0275371 -0.0415061 1.1102466 -0.5113173 -0.0273751 -0.1330788 0.6526066 -0.0041777 -0.0339207 0.0087395 0.1217273 1.5068549 0.051882 -0.0472302 0.0806266 1.8258526 -0.0304824 -0.0463407 -0.0290813 0.2438835 1.5010401 -0.5181744 -0.0482976 -0.4891025 1.1146291 -0.0020933 -0.0490691 -0.0011681 -0.0654404 1.4847732 0.002984 -0.0557098 -0.3366314 0.4537311 0.0037963 -0.0489091 -0.009156 -0.0082778 0.0955611 0.0390529 0.0019285 0.0849951 0.3735774 -0.0062618 0.000953 -0.0048955 0.1677247 0.2608534 0.1363328 -0.0059187 0.1373018 0.1019943 -0.0038777 -0.0060505 -0.0037338 0.1678015 0.1019141 0.1406004 -0.0051057 0.2022647 0.1803363 -0.0096587 -0.005128 -0.0072574 0.0539702 0.2157713 -0.0261602 0.0054799 0.0075231 0.2803137 0.0005919 0.0053191 0.0003706 0.3538982 0.075346 0.0617332 -0.0823937 -0.0122148 0.0175768 0.0250531 -0.0387918 0.053632 -0.0220855 -0.0323424 -0.0963232 0.0072962 -0.0129628 0.1404761 0.0001819 0.0059055 0.0031982 0.1240627 0.0834475 0.0599393 0.0728755 -0.0131035 0.0147546 -0.0253577 0.0316481 -0.059415 -0.0278812 0.0042959 -0.0233761 -0.0407074 0.0528099 0.107347 0.0753893 -0.0567798 0.0268168 -0.026699 0.010905 -0.0244461 0.0389951 0.048228 0.1036555 -0.0829519 0.0528943 -0.0292736 -0.0307001 0.1940379 0.077634 -0.0032941 -0.083622 -0.0285046 0.0052198 -0.000529 -0.0002713 0.1327956 0.114759 0.0224414 -0.0698202 -0.0529266 -0.0201564 0.0675029 -0.0566295 0.045346 -0.0050849 -0.1119711 -0.0151026 0.0104458 -0.0044881 0.080808 0.0009902 0.0100161 0.0014068 0.1322004 0.1240037 0.0209716 0.0584334 -0.0564856 -0.024873 -0.0630015 0.0482223 -0.046893 -0.0104561 unknown
polarizability: 246.634301|-11.2601778|169.1093576|-6.3264872|-1.328021|69.9190241 unknown
InChI: InChI=1S/C8H10N4OS2/c1-11-5-4(9-7(10-5)15-3)6(13)12(2)8(11)14/h9H,1-3H3
charge 0 multiplicity 1
25 atoms
S  4.121365 -0.740339 -0.218347
S  -3.341707 1.925106 0.007944
O  -1.371207 -2.811232 0.017444
N  -0.688544 1.323281 -0.07884
N  -2.182074 -0.565038 0.007377
N  1.442957 -1.520004 -0.10491
N  1.729465 0.741339 -0.156585
C  0.161487 -0.952032 -0.069751
C  0.373556 0.431184 -0.102155
C  -1.131611 -1.566061 -0.012428
C  -2.010509 0.839579 -0.024012
C  2.347578 -0.469692 -0.157704
C  -0.429117 2.777987 -0.111132
C  -3.568416 -1.085214 0.065815
C  4.682836 1.057847 -0.278062
H  1.640173 -2.520746 -0.100482
H  -0.916079 3.226906 -0.992323
H  0.661157 2.918633 -0.153145
H  -0.851082 3.254645 0.788839
H  -4.137524 -0.735743 -0.811063
H  -4.072381 -0.709672 0.97132
H  -3.503783 -2.183012 0.07951
H  4.266624 1.539413 -1.172887
H  5.781356 1.01484 -0.323706
H  4.342977 1.575624 0.628785
