program: Gaussian 09
title: 000096970
version: EM64L-G09RevD.01
frameworkgroup: C1[X(C10H14N4OS2)]
method: RPBEPBE
basis: SDD
operation: Freq
keyword: #p
keyword: freq=noraman
keyword: PBEPBE/SDD
title: #p freq=noraman PBEPBE/SDD
converged: NO YES NO NO
title: Mulliken charges:
elementType: S S O N N N N C C C C C C C C C C H H H H H H H H H H H H H H
charge: 0.246484 -0.001924 -0.267198 -0.083486 -0.133723 -0.366528 -0.053710 0.100749 0.139187 0.146430 -0.262988 -0.185409 -0.617598 -0.593528 -0.608078 -0.351167 -0.670526 0.344709 0.261385 0.255898 0.261467 0.280185 0.280213 0.258034 0.267166 0.258026 0.218747 0.218740 0.215348 0.227737 0.215357
chargesum: 0.00000
title: Mulliken charges with hydrogens summed into heavy atoms:
elementType: S S O N N N N C C C C C C C C C C
charge: 0.246484 -0.001924 -0.267198 -0.083486 -0.133723 -0.021819 -0.053710 0.100749 0.139187 0.146430 -0.262988 -0.185409 0.161152 -0.033130 0.175148 0.086321 -0.012083
polarizability: 2.85966955e+02 9.23828482e+00 1.92531305e+02 -1.46213758e-02 3.09492251e-02 8.76731535e+01
1716.lowfreq: 0.0013 0.0023 0.0029 2.4809 7.6312 12.7698 22.5783 46.1754 52.6285
frequency: 22.2088 46.1150 52.6072 63.1335 91.1252 101.7914 118.0042 155.6423 176.1848 185.0693 191.7618 213.2544 215.1507 221.8073 278.7490 308.1553 318.6849 326.0453 356.0557 357.3048 383.1632 403.4853 430.4431 479.1647 569.2761 615.4761 628.5703 634.2527 636.6130 677.7217 690.3059 720.6982 736.8836 749.0507 854.8613 858.7668 902.3341 925.3126 947.7181 1046.4226 1046.7696 1062.8168 1096.1467 1107.5546 1117.1626 1127.5438 1128.5550 1166.6321 1193.4959 1215.3531 1242.7819 1256.4052 1269.6866 1286.1599 1296.6238 1325.8365 1337.6394 1374.8581 1392.0979 1393.2804 1429.0364 1441.0919 1447.3764 1459.2104 1467.2934 1471.4550 1474.7083 1476.8495 1476.8981 1486.9985 1506.9005 1582.1361 1659.2375 2982.0602 2991.7905 3008.8034 3009.5516 3040.8632 3043.5025 3080.3306 3085.0635 3099.8505 3101.7387 3124.4959 3135.5036 3135.6619 3587.8478
redmass: 4.6545 1.6321 4.3093 6.6959 4.2357 2.8824 6.1236 5.8400 1.3548 1.1256 2.2341 3.3250 4.4499 1.2060 8.5420 3.6123 6.6349 3.6840 7.4338 6.4235 5.1637 5.0591 7.3895 8.5333 7.9360 8.9104 8.2610 6.7772 1.3944 4.8288 5.5606 4.8709 11.4101 1.0821 5.0500 1.1780 1.8908 8.3868 8.1567 2.9920 3.1960 1.1777 3.5462 2.1367 2.3852 1.3043 1.3095 1.9240 2.4928 1.3979 7.3852 1.2702 4.6624 1.1014 7.1900 6.6083 1.5470 5.6340 1.3075 2.8052 1.2487 1.2096 1.0915 1.0428 1.0433 1.1221 1.1638 1.0483 1.0417 1.0851 3.4623 8.0238 10.9681 1.0355 1.0599 1.0326 1.0325 1.1021 1.0571 1.1015 1.0994 1.1017 1.1017 1.1093 1.1030 1.1027 1.0821
irintensity: 0.0969 0.6405 0.2970 0.1745 3.1144 0.2457 0.3497 2.3524 6.4165 1.0908 12.7041 0.0957 2.1885 0.0915 0.7818 12.5744 0.0960 0.3415 10.0001 0.2229 9.6073 7.1487 30.2844 7.5861 1.3367 2.3054 0.0015 1.2536 97.5384 17.0786 19.4081 0.2944 5.7436 12.0411 0.1045 0.2512 22.7663 16.4533 15.7180 18.5468 42.7631 1.8051 94.0374 41.0127 104.3975 0.8745 0.0298 27.9215 16.4919 0.0021 20.3029 17.8435 138.8887 0.1400 101.8215 25.8446 17.5558 4.3978 94.0201 531.6870 125.4766 18.4442 12.7757 17.6731 18.3293 37.4300 22.5510 4.3347 14.4181 16.4965 94.1923 104.8838 515.7007 31.6610 20.0435 18.7176 17.8435 4.4889 7.8238 45.9795 42.6381 6.8892 15.9156 18.8555 3.4367 0.3729 96.4778
temp: 298.150 k
press: 1.00000 atm
elementType: 16 16 8 7 7 7 7 6 6 6 6 6 6 6 6 6 6 1 1 1 1 1 1 1 1 1 1 1 1 1 1
symmnumber: 1
zpe: 627638.9 jmol-1
zpe.correction: 0.239055 hartree
zpe.thermalcorrener: 0.256949 hartree
zpe.thermalcorrenthalpy: 0.257893 hartree
zpe.thermalcorrgfe: 0.191619 hartree
zpe.sumelectzpe: -1478.576930 hartree
zpe.sumelectthermal: -1478.559036 hartree
zpe.sumelectthermalent: -1478.558092 hartree
zpe.sumelectthermalfe: -1478.624366 hartree
dipole: -6.0125 0.4834 -0.0006
dipole: 6.0319
quadrupole: -112.6945 -121.2353 -116.4156
quadrupole: -5.7079 -0.0007 -0.0012
quadrupole: 4.0873 -4.4535 0.3662 -5.7079 -0.0007 -0.0012
hfenergy: -1478.8159848 hartree
pointgroup: C01 [X(C10H14N4O1S2)]
dipole: 2.3730963 0.0112368 0.0002322 debye
polarizability: 284.0459417|-16.1600366|194.4523189|-0.0169139|-0.0297583|87.6731535 unknown
InChI: InChI=1S/C10H14N4OS2/c1-4-5-17-9-11-6-7(12-9)13(2)10(16)14(3)8(6)15/h11H,4-5H2,1-3H3
charge 0 multiplicity 1
31 atoms
S  3.158168 -1.507561 -0.001867
S  -3.750042 2.386262 -0.001417
O  -2.612618 -2.617393 0.000186
N  -1.236898 1.341262 -0.000133
N  -3.030373 -0.265704 0.000624
N  0.382665 -1.821697 -0.000872
N  1.049588 0.359552 -0.001166
C  -0.784524 -1.044845 -0.000493
C  -0.340077 0.28255 -0.0006
C  -2.163773 -1.4294 0.000073
C  -2.621905 1.088977 0.000673
C  1.45502 -0.94014 -0.001201
C  -0.734066 2.731586 -0.001057
C  4.03659 0.184991 -0.000976
C  -4.48598 -0.545001 0.00078
C  5.555275 -0.048361 -0.001212
C  6.316285 1.297703 -0.000749
H  0.406721 -2.841359 -0.000851
H  -1.103501 3.263127 -0.893442
H  0.364885 2.68484 0.000908
H  -1.107068 3.265293 0.888477
H  3.691976 0.723438 0.895948
H  3.691844 0.724442 -0.897242
H  -4.953802 -0.09599 0.892153
H  -4.605871 -1.638189 0.001517
H  -4.953839 -0.097396 -0.891306
H  5.844782 -0.639741 0.88864
H  5.844626 -0.638996 -0.891612
H  6.067572 1.898418 0.893528
H  7.407495 1.127153 -0.000747
H  6.067644 1.898977 -0.894665
