program: Gaussian 09
title: 000010778
version: EM64L-G09RevD.01
frameworkgroup: C1[X(C9H10O2)]
method: RPBEPBE
basis: SDD
operation: Freq
keyword: #pfreq=noraman
keyword: PBEPBE/SDD
title: #p freq=noraman PBEPBE/SDD
converged: YES YES NO NO
title: Mulliken charges:
elementType: O O C C C C C C C C C H H H H H H H H H H
charge: -0.299454 -0.215599 0.338791 0.259098 -0.381554 -0.352387 -0.812234 -0.234025 -0.216924 0.245671 -0.745074 0.232891 0.247307 0.224657 0.229723 0.269693 0.228122 0.231230 0.250714 0.247468 0.251888
chargesum: 0.00000
title: Mulliken charges with hydrogens summed into heavy atoms:
elementType: O O C C C C C C C C C
charge: -0.299454 -0.215599 0.338791 0.259098 -0.148664 -0.105080 -0.088161 -0.005904 0.014306 0.245671 0.004997
polarizability: 1.31939514e+02 -3.19963454e+00 1.03578726e+02 6.66413516e+00 1.93281901e+00 6.22269398e+01
1716.lowfreq: -6.9560 -0.0005 0.0003 0.0009 10.7323 11.1519 30.9994 60.0993 85.3564
frequency: 30.1491 60.0186 85.3082 101.6281 154.8887 192.1176 276.5323 280.4873 317.2599 420.5584 447.6039 504.6992 519.4411 553.4990 568.8915 645.1306 701.6696 729.6095 769.3494 800.6741 862.4476 875.8188 944.6944 983.4677 986.4753 990.0526 1038.8121 1040.7277 1050.4516 1097.3184 1156.3942 1170.2086 1182.8319 1223.8346 1280.0192 1378.1584 1381.5791 1396.9335 1432.3518 1452.3056 1452.7457 1465.4646 1477.6922 1486.0994 1588.6411 1618.6887 1673.6819 2982.2187 3008.7366 3064.3049 3091.4309 3096.3042 3125.6623 3139.7708 3144.8387 3155.7118 3171.5721
redmass: 1.2266 4.8661 2.4854 4.4382 1.3216 2.1765 3.8127 3.6836 3.6897 3.5389 2.9580 4.8238 3.7065 4.0725 4.1340 5.3615 4.3019 2.1837 1.8433 3.9454 1.5531 3.7066 1.3882 1.3215 1.6175 1.9768 1.6759 1.9748 1.5343 2.4504 2.1358 1.0765 3.1548 2.6214 1.4783 7.1849 1.2450 1.2389 2.1997 1.0580 1.0499 1.0772 2.2856 1.1939 6.0602 7.2670 9.8721 1.0365 1.0367 1.0977 1.0995 1.0973 1.0866 1.0895 1.1012 1.0945 1.1003
irintensity: 2.2993 0.4450 2.4962 2.7838 2.0204 3.1918 2.6548 1.9982 1.9036 1.4776 7.4621 9.1996 0.9732 5.9635 1.6389 3.7654 2.9912 20.6640 49.2909 32.0614 6.9189 39.0767 3.4409 0.0434 0.2461 72.0285 10.9113 6.8777 7.8215 113.5694 229.9563 3.2656 190.8863 6.5661 0.9962 1.4561 59.9097 13.7214 5.6949 28.1134 20.5279 19.6030 27.5621 36.2820 8.0199 0.7339 164.1606 21.6686 1.9016 10.6428 19.7694 6.0959 4.9588 11.4373 10.2937 25.3342 14.5282
temp: 298.150 k
press: 1.00000 atm
elementType: 8 8 6 6 6 6 6 6 6 6 6 1 1 1 1 1 1 1 1 1 1
symmnumber: 1
zpe: 435608.0 jmol-1
zpe.correction: 0.165914 hartree
zpe.thermalcorrener: 0.176856 hartree
zpe.thermalcorrenthalpy: 0.177801 hartree
zpe.thermalcorrgfe: 0.128143 hartree
zpe.sumelectzpe: -498.604791 hartree
zpe.sumelectthermal: -498.593849 hartree
zpe.sumelectthermalent: -498.592905 hartree
zpe.sumelectthermalfe: -498.642563 hartree
dipole: -0.1873 -0.2331 -1.5647
dipole: 1.5930
quadrupole: -52.9125 -57.5248 -72.4799
quadrupole: 1.7472 5.2876 -1.8616
quadrupole: 8.0599 3.4476 -11.5075 1.7472 5.2876 -1.8616
hfenergy: -498.7707053 hartree
pointgroup: C01 [X(C9H10O2)]
dipole: 0.0722186 -0.0242065 -0.6220916 debye
dipolederiv: -1.8460672 0.0858485 -0.2750896 0.1641486 -0.2837584 0.0856859 -0.3378497 0.0779325 -0.5778389 -0.6273963 -0.0285885 0.1259131 0.0766527 -0.3083537 0.1140384 -0.3633142 0.12227 -0.902649 -0.1020049 -0.1774138 -0.0013277 -0.1978197 0.1935431 0.0217806 0.0951241 -0.0344444 -0.0200779 1.1033227 -0.0303311 0.0156825 0.0892276 0.1038289 0.0024753 -0.2808012 0.0097591 0.0053828 -0.0225669 0.1405545 -0.0518141 0.043826 0.007318 -0.0522119 -0.0426832 -0.0656509 -0.1393149 -0.1816067 0.0338296 -0.0598383 0.0678343 -0.0200837 -0.0439503 -0.0059723 -0.0216197 -0.1157231 -0.037037 0.1468334 -0.0159716 0.0878477 -0.0567758 0.011589 -0.0376664 0.0541787 0.0295079 0.0752785 -0.0005197 -0.0543097 0.0214591 -0.049725 -0.019203 -0.0545993 -0.0141372 -0.1409937 -0.0253718 -0.0544328 -0.0251702 -0.0563769 0.0520228 -0.0188003 -0.0254808 -0.0236211 -0.1579909 1.8488172 -0.0135908 0.0952398 -0.2538857 0.2379778 -0.245983 0.7684354 -0.2194084 1.3016493 -0.3656274 -0.0244662 0.1420582 -0.0295219 0.0214203 0.0344753 0.2150516 0.0251433 -0.1036413 0.0359814 -0.0583107 0.0265806 -0.0908295 -0.0710617 0.0492045 0.0371449 0.0442257 0.1384444 0.059651 -0.0800269 0.0437184 -0.0729059 -0.0151474 0.038389 0.0347023 0.0426593 0.1481118 -0.0219563 -0.1633385 0.0044028 -0.0665858 -0.0615204 -0.0033396 0.0129476 -0.0024164 0.1167481 0.0160858 0.052985 0.1100715 0.0402013 0.0510092 0.0248032 0.116669 -0.0487618 -0.0295594 0.0399482 0.058377 -0.0853251 0.0433078 0.0668753 -0.0219926 -0.0960606 0.0260145 -0.0054819 -0.1232923 0.0135782 0.0527603 0.0051036 0.0862649 0.0103522 0.0579608 0.0092815 0.149773 0.0216337 0.0897698 0.0059873 0.0995882 -0.0673286 0.0212985 0.0098144 0.021716 0.1569725 0.0893582 -0.0262156 -0.0101888 0.0236621 0.0394904 -0.1098632 -0.0021184 -0.0953958 0.0229265 -0.0309917 0.0159439 -0.0532848 0.0345886 0.1170672 0.0300348 -0.1025147 0.0292876 0.0127646 0.0938417 0.019515 0.0099054 -0.0295221 -0.0430632 0.071217 0.0012104 0.0629874 0.1109898 unknown
polarizability: 131.2411141|-6.2845973|102.2871118|-6.5710852|-8.6457262|64.2169547 unknown
InChI: InChI=1S/C9H10O2/c1-7-5-3-4-6-9(7)11-8(2)10/h3-6H,1-2H3
charge 0 multiplicity 1
21 atoms
O  1.238774 0.285673 -0.711232
O  1.999202 -0.22631 1.45102
C  -0.788818 -0.963841 -0.007855
C  -0.149497 0.259458 -0.331284
C  -2.179444 -0.901666 0.266123
C  -0.839873 1.484661 -0.396861
C  -0.032197 -2.275134 0.039207
C  -2.893423 0.316583 0.217271
C  -2.223628 1.515216 -0.118766
C  2.242594 0.03488 0.258232
C  3.602431 0.143844 -0.394427
H  -2.705526 -1.82988 0.518915
H  -0.290606 2.392593 -0.664947
H  -0.727864 -3.130598 0.05854
H  0.632909 -2.389509 -0.836438
H  0.602705 -2.325149 0.942974
H  -3.967017 0.32868 0.434335
H  -2.769366 2.463501 -0.164705
H  3.680061 -0.569635 -1.232908
H  4.387918 -0.061445 0.346526
H  3.739467 1.155479 -0.814119
